{"text_format":"1","workbook":"xlsx","n_sheets":7,"sheets":["Notice","Global","Data Input","Calculations","Summary","LookupTables","nav_inputs"],"not_rendered":{"charts":0,"images":3,"macros":1,"external_links":0,"defined_names":99,"comments":3,"pivot_tables":0},"unopened":[],"bounds":{"document_bytes":16777216,"sheet_cells":100000,"rows_first":2000,"rows_last":500,"rows_between":2000,"halvings":0,"cell_chars":16384,"cell_head_chars":4096},"cells_cut":0,"cells_raw":0,"read":"whole","date_system":"1900"}

{"sheet":"Notice","index":0,"n_rows":11,"n_cols":2,"rows_kept":11,"cut":false,"hidden":false,"merged":[]}
[]
[null,"DISCLAIMER"]
[]
[null,"1.  This workbook is the property of Fonterra Co-operative Group Limited (Fonterra)."]
[null,"2.  The workbook contains the higher level inputs and calculations underpinning the calculation of the Farmgate Milk Price for the 2015/16 season."]
[null,"To protect the commercial confidentiality of certain information derived from Fonterra's actual performance data, a number of inputs have been aggregated for the purposes of this workbook."]
[null,"The workbook does not contain all the intermediate calculations required to calculate the Farmgate Milk Price.  For example, the workbook does not contain the calculations required to convert contracted prices into 'shipment month' prices, or the "]
[null,"'tilted annuity' calculations used to calculate the WACC charge and depreciation inputs."]
[null,"3.  Fonterra does not warrant that the workbook is free from error, and explicitly disclaims any liability to any third party with respect to any use they may make of the workbook."]
[null,"4. Third party recipients of this workbook use it entirely at their own risk.  Fonterra will not accept any responsibility any loss which may result from use of the workbook including the direct or indirect consequences of computer viruses."]
[null,"5. The workbook was not designed for use by third parties and Fonterra provides no assurance that third parties will be able to be readily operate the workbook. "]

{"sheet":"Global","index":1,"n_rows":58,"n_cols":44,"rows_kept":58,"cut":false,"hidden":false,"merged":[]}
[null,null,null,null,null,null,null,null,null,null,"F16 Milk Price",null,null,{"$f":"Summary!L104","v":3.8950833184115519},3.8950833184115528,{"$f":"O1-MilkPrice","v":0}]
[null,null,null,null,null,null,null,null,null,null,"Average FX conversion rate (Sales)",null,null,{"$f":"Summary!L20","v":0.7082075110462589}]
[]
[]
[]
[]
[null,null,null,null,null,"Period Ended",null,null,null,null,null,null,null,null,{"$f":"K34","v":"2016-05-31"},null,{"$f":"EOMONTH(T7,-1)","v":"2015-05-31"},{"$f":"EOMONTH(S7,-1)","v":"2015-04-30"},{"$f":"EOMONTH(T7,-1)","v":"2015-05-31"},{"$f":"K32","v":"2015-06-30"},{"$f":"EOMONTH(T7,1)","v":"2015-07-31"},"2015-08-31","2015-09-30","2015-10-31","2015-11-30","2015-12-31","2016-01-31","2016-02-29","2016-03-31","2016-04-30","2016-05-31","2016-06-30","2016-07-31","2016-08-31","2016-09-30","2016-10-31","2016-11-30","2016-12-31","2017-01-31","2017-02-28","2017-03-31",{"$f":"EOMONTH(AO7,1)","v":"2017-04-30"},{"$f":"EOMONTH(AP7,1)","v":"2017-05-31"},{"$f":"EOMONTH(AQ7,1)","v":"2017-06-30"}]
[null,null,null,"Calendar Year",null,null,null,null,null,null,null,null,null,null,null,null,null,null,null,{"$f":"YEAR(T7)","v":2015},2015,2015,2015,2015,2015,2015,2016,2016,2016,2016,2016,2016,2016,2016,2016,2016,2016,2016,2017,2017,2017]
[null,null,null,"Month Number",null,null,null,null,null,null,null,null,null,null,null,null,null,null,null,1,{"$f":"T9+1","v":2},3,4,5,6,7,8,9,10,11,12,13,14,15,16,17,18,19,20,21,22]
[null,null,null,"Days in Period",null,null,null,null,null,null,null,null,null,null,null,null,null,{"$f":"R7-EOMONTH(R7,-1)","v":30},{"$f":"S7-R7","v":31},{"$f":"T7-S7","v":30},{"$f":"U7-T7","v":31},31,30,31,30,31,31,29,31,30,31,30,31,31,30,31,30,31,31,28,31]
[null,null,null,"Year to Go flag",null,null,null,null,null,null,null,null,null,null,{"$f":"INDEX(LookupTables!E11:E28,LookupTables!I11)","v":"2016-09-30"},{"$f":"LookupTables!I11","v":16},null,null,null,{"$f":"IF(T9<=$P$11,1,0)","v":1},1,1,1,1,1,1,1,1,1,1,1,1,1,1,1,0,0,0,0,0,0]
[]
[null,null,"GENERAL MODEL INPUTS"]
[]
[null,null,"MODEL INFORMATION"]
[]
[null,null,"This model contains circular logic relating to the calculation of tax expense and net working capital.  It is therefore necessary to set the calculation approach to 'iterative calculations.'"]
[]
[]
[null,null,"INPUT KEY"]
{"$rows_left_out":39}
{"sheet":"Data Input","index":2,"n_rows":266,"n_cols":41,"rows_kept":266,"cut":false,"hidden":false,"merged":[]}
[]
[]
[]
[null,null,null,null,null,{"$f":"Calculations!F5","v":"Overall error check"},null,null,null,{"$f":"IF(COUNTA(B:B)=COUNTIF(B:B,\"Okay\"),\"Okay\",\"Error\")","v":"Okay"},null,null,"Annual",null,null,null,null,null,null,"Monthly"]
[]
[null,null,null,null,null,null,null,null,null,"Units","Input",null,null,{"$f":"Global!O7","v":"2016-05-31"},null,null,"Date",{"$f":"Global!R7","v":"2015-04-30"},{"$f":"Global!S7","v":"2015-05-31"},{"$f":"Global!T7","v":"2015-06-30"},{"$f":"Global!U7","v":"2015-07-31"},{"$f":"Global!V7","v":"2015-08-31"},{"$f":"Global!W7","v":"2015-09-30"},{"$f":"Global!X7","v":"2015-10-31"},{"$f":"Global!Y7","v":"2015-11-30"},{"$f":"Global!Z7","v":"2015-12-31"},{"$f":"Global!AA7","v":"2016-01-31"},{"$f":"Global!AB7","v":"2016-02-29"},{"$f":"Global!AC7","v":"2016-03-31"},{"$f":"Global!AD7","v":"2016-04-30"},{"$f":"Global!AE7","v":"2016-05-31"},{"$f":"Global!AF7","v":"2016-06-30"},{"$f":"Global!AG7","v":"2016-07-31"},{"$f":"Global!AH7","v":"2016-08-31"},{"$f":"Global!AI7","v":"2016-09-30"},{"$f":"Global!AJ7","v":"2016-10-31"},{"$f":"Global!AK7","v":"2016-11-30"},{"$f":"Global!AL7","v":"2016-12-31"},{"$f":"Global!AM7","v":"2017-01-31"},{"$f":"Global!AN7","v":"2017-02-28"},{"$f":"Global!AO7","v":"2017-03-31"}]
[null,null,null,"Calendar Year",null,null,null,null,null,null,null,null,null,null,null,null,null,null,null,{"$f":"YEAR(T6)","v":2015},2015,2015,2015,2015,2015,2015,{"$f":"YEAR(AA6)","v":2016},2016,2016,2016,2016,2016,2016,2016,2016,2016,2016,2016,2017,{"$f":"YEAR(AN6)","v":2017},{"$f":"YEAR(AO6)","v":2017}]
[null,null,null,"Month Number",null,null,null,null,null,null,null,null,null,null,null,null,null,null,null,{"$f":"Global!T9","v":1},{"$f":"Global!U9","v":2},{"$f":"Global!V9","v":3},{"$f":"Global!W9","v":4},{"$f":"Global!X9","v":5},{"$f":"Global!Y9","v":6},{"$f":"Global!Z9","v":7},{"$f":"Global!AA9","v":8},{"$f":"Global!AB9","v":9},{"$f":"Global!AC9","v":10},{"$f":"Global!AD9","v":11},{"$f":"Global!AE9","v":12},{"$f":"Global!AF9","v":13},{"$f":"Global!AG9","v":14},{"$f":"Global!AH9","v":15},{"$f":"Global!AI9","v":16},{"$f":"Global!AJ9","v":17},{"$f":"Global!AK9","v":18},{"$f":"Global!AL9","v":19},{"$f":"Global!AM9","v":20},{"$f":"Global!AN9","v":21},{"$f":"Global!AO9","v":22}]
[null,null,null,"Days in Period",null,null,null,null,null,null,null,null,null,null,null,null,null,{"$f":"Global!R10","v":30},{"$f":"Global!S10","v":31},{"$f":"Global!T10","v":30},{"$f":"Global!U10","v":31},{"$f":"Global!V10","v":31},{"$f":"Global!W10","v":30},{"$f":"Global!X10","v":31},{"$f":"Global!Y10","v":30},{"$f":"Global!Z10","v":31},{"$f":"Global!AA10","v":31},{"$f":"Global!AB10","v":29},{"$f":"Global!AC10","v":31},{"$f":"Global!AD10","v":30},{"$f":"Global!AE10","v":31},{"$f":"Global!AF10","v":30},{"$f":"Global!AG10","v":31},{"$f":"Global!AH10","v":31},{"$f":"Global!AI10","v":30},{"$f":"Global!AJ10","v":31},{"$f":"Global!AK10","v":30},{"$f":"Global!AL10","v":31},{"$f":"Global!AM10","v":31},{"$f":"Global!AN10","v":28},{"$f":"Global!AO10","v":31}]
[null,null,null,"Year to Go flag",null,null,null,null,null,null,null,null,null,1,null,{"$f":"Global!P11","v":16},null,null,null,{"$f":"Global!T11","v":1},{"$f":"Global!U11","v":1},{"$f":"Global!V11","v":1},{"$f":"Global!W11","v":1},{"$f":"Global!X11","v":1},{"$f":"Global!Y11","v":1},{"$f":"Global!Z11","v":1},{"$f":"Global!AA11","v":1},{"$f":"Global!AB11","v":1},{"$f":"Global!AC11","v":1},{"$f":"Global!AD11","v":1},{"$f":"Global!AE11","v":1},{"$f":"Global!AF11","v":1},{"$f":"Global!AG11","v":1},{"$f":"Global!AH11","v":1},{"$f":"Global!AI11","v":1},{"$f":"Global!AJ11","v":0},{"$f":"Global!AK11","v":0},{"$f":"Global!AL11","v":0},{"$f":"Global!AM11","v":0},{"$f":"Global!AN11","v":0},{"$f":"Global!AO11","v":0}]
[null,null,null,null,null,null,null,null,null,null,null,null,null,null,null,null,"updated",null,null,{"$f":"T6","v":"2015-06-30"},"2015-07-31","2015-08-31","2015-09-30","2015-10-31","2015-11-30","2015-12-31","2016-01-31","2016-02-29","2016-03-31","2016-04-30","2016-05-31","2016-06-30","2016-07-31","2016-08-31","2016-09-30","2016-10-31","2016-11-30","2016-12-31","2017-01-31",{"$f":"AN6","v":"2017-02-28"},{"$f":"AO6","v":"2017-03-31"}]
[]
[]
[null,null,null,null,null,"GLOBAL"]
[]
[null,null,null,null,null,"STATUS / DATA SOURCE",null,null,null,"Weighted average annual FX rate for revenue.  Also used in this simplified model to translate costs.  In practice, USD purchases have a different time profile, & therefore weighted average conversion rate, to sales."]
[null,null,null,null,null,null,null,null,null,"We have adjusted the USD cost inputs to correct for this difference (so reported NZD values reconcile to the actual F16 milk price calculation.)"]
[]
[]
[null,null,null,null,null,"FX"]
{"$rows_left_out":247}
{"sheet":"Calculations","index":3,"n_rows":1315,"n_cols":43,"rows_kept":1315,"cut":false,"hidden":false,"merged":[[149,3,181,3],[183,3,211,3],[58,3,147,3]]}
[]
[]
[]
[]
[null,null,null,null,null,"Overall error check",null,null,null,{"$f":"IF(COUNTA(B:B)=COUNTIF(B:B,\"Okay\"),\"Okay\",\"Error\")","v":"Okay"},null,null,null,"Annual",null,null,null,null,null,"Monthly"]
[]
[]
[]
[null,null,null,null,null,null,null,null,null,"Units","Cross Reference",null,null,{"$f":"Global!O7","v":"2016-05-31"},null,null,null,{"$f":"Global!R7","v":"2015-04-30"},{"$f":"Global!S7","v":"2015-05-31"},{"$f":"Global!T7","v":"2015-06-30"},{"$f":"Global!U7","v":"2015-07-31"},{"$f":"Global!V7","v":"2015-08-31"},{"$f":"Global!W7","v":"2015-09-30"},{"$f":"Global!X7","v":"2015-10-31"},{"$f":"Global!Y7","v":"2015-11-30"},{"$f":"Global!Z7","v":"2015-12-31"},{"$f":"Global!AA7","v":"2016-01-31"},{"$f":"Global!AB7","v":"2016-02-29"},{"$f":"Global!AC7","v":"2016-03-31"},{"$f":"Global!AD7","v":"2016-04-30"},{"$f":"Global!AE7","v":"2016-05-31"},{"$f":"Global!AF7","v":"2016-06-30"},{"$f":"Global!AG7","v":"2016-07-31"},{"$f":"Global!AH7","v":"2016-08-31"},{"$f":"Global!AI7","v":"2016-09-30"},{"$f":"Global!AJ7","v":"2016-10-31"},{"$f":"Global!AK7","v":"2016-11-30"},{"$f":"Global!AL7","v":"2016-12-31"},{"$f":"Global!AM7","v":"2017-01-31"},{"$f":"Global!AN7","v":"2017-02-28"},{"$f":"Global!AO7","v":"2017-03-31"},{"$f":"Global!AP7","v":"2017-04-30"},{"$f":"Global!AQ7","v":"2017-05-31"}]
[null,null,null,"Calendar Year",null,null,null,null,null,null,null,null,null,null,null,null,null,null,null,{"$f":"YEAR(T9)","v":2015},{"$f":"YEAR(U9)","v":2015},2015,2015,2015,2015,2015,2016,2016,2016,2016,2016,2016,2016,2016,2016,2016,2016,2016,{"$f":"YEAR(AM9)","v":2017},{"$f":"YEAR(AN9)","v":2017},{"$f":"YEAR(AO9)","v":2017},{"$f":"YEAR(AP9)","v":2017}]
[null,null,null,"Month Number",null,null,null,null,null,null,null,null,null,null,null,null,null,null,null,1,{"$f":"T11+1","v":2},{"$f":"U11+1","v":3},{"$f":"V11+1","v":4},5,6,7,8,9,10,11,12,13,14,15,16,17,18,19,{"$f":"AL11+1","v":20},{"$f":"AM11+1","v":21},{"$f":"AN11+1","v":22},{"$f":"AO11+1","v":23}]
[null,null,null,"Days in Period",null,null,null,null,null,null,null,null,null,null,null,null,null,{"$f":"Global!R10","v":30},{"$f":"Global!S10","v":31},{"$f":"Global!T10","v":30},{"$f":"U9-T9","v":31},{"$f":"V9-U9","v":31},30,31,30,31,31,29,31,30,31,30,31,31,30,31,30,31,31,28,31,30]
[null,null,null,"Year to Go flag",null,null,null,null,null,null,null,null,null,1,null,{"$f":"Global!P11","v":16},null,null,null,{"$f":"Global!T11","v":1},{"$f":"Global!U11","v":1},{"$f":"Global!V11","v":1},{"$f":"Global!W11","v":1},{"$f":"Global!X11","v":1},{"$f":"Global!Y11","v":1},{"$f":"Global!Z11","v":1},{"$f":"Global!AA11","v":1},{"$f":"Global!AB11","v":1},{"$f":"Global!AC11","v":1},{"$f":"Global!AD11","v":1},{"$f":"Global!AE11","v":1},{"$f":"Global!AF11","v":1},{"$f":"Global!AG11","v":1},{"$f":"Global!AH11","v":1},{"$f":"Global!AI11","v":1},{"$f":"Global!AJ11","v":0},{"$f":"Global!AK11","v":0},{"$f":"Global!AL11","v":0},{"$f":"Global!AM11","v":0},{"$f":"Global!AN11","v":0},{"$f":"Global!AO11","v":0}]
[null,null,null,"PRODUCTION"]
[]
[null,null,null,"COMMENT",null,"See comments below.   Production volumes to model have been hardcoded to align to actual volumes.  Detail of loss assumptions & specification offsets, which is confidential to Fonterra, is required to"]
[null,null,null,null,null,"flow milk supply through yield logic.  Logic has however been retained in the model, and we have disclosed overall valued component usages by RCP (in cells O59:P63)."]
[]
[]
[null,null,null,"DATA INPUT"]
{"$rows_left_out":1296}
{"sheet":"Summary","index":4,"n_rows":141,"n_cols":36,"rows_kept":141,"cut":false,"hidden":false,"merged":[]}
[]
[]
[null,null,null,null,null,null,null,null,null,1]
[null,null,null,null,null,null,null,null,null,null,null,null,null,null,null,null,null,null,"MONTHLY"]
[null,null,null,null,null,null,null,null,"Period Number",null,null,null,null,null,1,1,1,{"$f":"IF(Q5=12,1,Q5+1)","v":2},3,4,5,6,7,8,9,10,11,12,1,2,3,4,5,6,7,8]
[null,null,null,null,null,null,null,null,null,null,null,null,null,null,{"$f":"Global!R36","v":"2015-04-30"},{"$f":"Global!S36","v":"2015-05-31"},{"$f":"Global!T36","v":"2015-06-30"},{"$f":"Global!U36","v":"2015-07-31"},{"$f":"Global!V36","v":"2015-08-31"},{"$f":"Global!W36","v":"2015-09-30"},{"$f":"Global!X36","v":"2015-10-31"},{"$f":"Global!Y36","v":"2015-11-30"},{"$f":"Global!Z36","v":"2015-12-31"},{"$f":"Global!AA36","v":"2016-01-31"},{"$f":"Global!AB36","v":"2016-02-29"},{"$f":"Global!AC36","v":"2016-03-31"},{"$f":"Global!AD36","v":"2016-04-30"},{"$f":"Global!AE36","v":"2016-05-31"},{"$f":"Global!AF36","v":"2016-06-30"},{"$f":"Global!AG36","v":"2016-07-31"},{"$f":"Global!AH36","v":"2016-08-31"},{"$f":"Global!AI36","v":"2016-09-30"},{"$f":"Global!AJ36","v":"2016-10-31"},{"$f":"Global!AK36","v":"2016-11-30"},{"$f":"Global!AL36","v":"2016-12-31"},{"$f":"Global!AM36","v":"2017-01-31"}]
[null,null,null,null,null,null,null,null,"Period",null,null,null,null,null,1,1,1,{"$f":"Q7+1","v":2},3,4,5,6,7,8,9,10,11,12,13,14,15,16,17,18,19,20]
[]
[null,null,null,null,null,null,null,null,"Financial Year",null,null,{"$f":"Global!O7","v":"2016-05-31"},null,null,{"$f":"Global!R36","v":"2015-04-30"},{"$f":"Global!S36","v":"2015-05-31"},{"$f":"Global!T36","v":"2015-06-30"},{"$f":"Global!U36","v":"2015-07-31"},{"$f":"Global!V36","v":"2015-08-31"},{"$f":"Global!W36","v":"2015-09-30"},{"$f":"Global!X36","v":"2015-10-31"},{"$f":"Global!Y36","v":"2015-11-30"},{"$f":"Global!Z36","v":"2015-12-31"},{"$f":"Global!AA36","v":"2016-01-31"},{"$f":"Global!AB36","v":"2016-02-29"},{"$f":"Global!AC36","v":"2016-03-31"},{"$f":"Global!AD36","v":"2016-04-30"},{"$f":"Global!AE36","v":"2016-05-31"},{"$f":"Global!AF36","v":"2016-06-30"},{"$f":"Global!AG36","v":"2016-07-31"},{"$f":"Global!AH36","v":"2016-08-31"},{"$f":"Global!AI36","v":"2016-09-30"},{"$f":"Global!AJ36","v":"2016-10-31"},{"$f":"Global!AK36","v":"2016-11-30"},{"$f":"Global!AL36","v":"2016-12-31"},{"$f":"Global!AM36","v":"2017-01-31"}]
[null,null,null,null,null,null,null,null,"KGMS 000s "]
[null,null,null,null,null,null,null,null,"Milk Supply Paid for ",null,null,{"$f":"SUM(O11:AB11)","v":1566433.5843999996},null,null,{"$f":"'Data Input'!R31","v":0},{"$f":"'Data Input'!S31","v":0},{"$f":"'Data Input'!T31","v":10047.626399999999},{"$f":"'Data Input'!U31","v":16579.810199999945},{"$f":"'Data Input'!V31","v":100769.34419999995},{"$f":"'Data Input'!W31","v":178143.29919999989},{"$f":"'Data Input'!X31","v":222558.39149999991},{"$f":"'Data Input'!Y31","v":208735.58989999941},{"$f":"'Data Input'!Z31","v":195565.65109999973},{"$f":"'Data Input'!AA31","v":175038.60409999988},{"$f":"'Data Input'!AB31","v":144117.54520000011},{"$f":"'Data Input'!AC31","v":136057.78620000035},{"$f":"'Data Input'!AD31","v":111779.27770000011},{"$f":"'Data Input'!AE31","v":67040.658699999985}]
[null,null,null,null,null,null,null,null,"Milk Supply Collected",null,null,{"$f":"SUM(O12:AB12)","v":1566428.2626999994},null,null,{"$f":"'Data Input'!R32","v":0},{"$f":"'Data Input'!S32","v":0},{"$f":"'Data Input'!T32","v":10043.178599999999},{"$f":"'Data Input'!U32","v":16578.936299999947},{"$f":"'Data Input'!V32","v":100769.34419999995},{"$f":"'Data Input'!W32","v":178143.29919999989},{"$f":"'Data Input'!X32","v":222558.39149999991},{"$f":"'Data Input'!Y32","v":208735.58989999941},{"$f":"'Data Input'!Z32","v":195565.65109999973},{"$f":"'Data Input'!AA32","v":175038.60409999988},{"$f":"'Data Input'!AB32","v":144117.54520000011},{"$f":"'Data Input'!AC32","v":136057.78620000035},{"$f":"'Data Input'!AD32","v":111779.27770000011},{"$f":"'Data Input'!AE32","v":67040.658699999985}]
[]
[null,null,null,null,null,null,null,null,"$'000"]
[]
[null,null,null,null,null,null,null,null,"NZD Revenue"]
[null,null,null,null,null,null,null,null,"Sales",{"$f":"$J$3&I17","v":"1Sales"},null,{"$f":"SUM(O17:AJ17)","v":9133955.7940697875},null,null,{"$f":"-SUMIF(Calculations!$I$15:$I$1318,$J17,Calculations!R$15:R$1318)","v":0},{"$f":"-SUMIF(Calculations!$I$15:$I$1318,$J17,Calculations!S$15:S$1318)","v":0},{"$f":"-SUMIF(Calculations!$I$15:$I$1318,$J17,Calculations!T$15:T$1318)","v":0},{"$f":"-SUMIF(Calculations!$I$15:$I$1318,$J17,Calculations!U$15:U$1318)","v":0},{"$f":"-SUMIF(Calculations!$I$15:$I$1318,$J17,Calculations!V$15:V$1318)","v":0},{"$f":"-SUMIF(Calculations!$I$15:$I$1318,$J17,Calculations!W$15:W$1318)","v":355848.72565361334},{"$f":"-SUMIF(Calculations!$I$15:$I$1318,$J17,Calculations!X$15:X$1318)","v":355848.72565361334},{"$f":"-SUMIF(Calculations!$I$15:$I$1318,$J17,Calculations!Y$15:Y$1318)","v":1186993.1612091614},{"$f":"-SUMIF(Calculations!$I$15:$I$1318,$J17,Calculations!Z$15:Z$1318)","v":1186993.1612091614},{"$f":"-SUMIF(Calculations!$I$15:$I$1318,$J17,Calculations!AA$15:AA$1318)","v":1186993.1612091614},{"$f":"-SUMIF(Calculations!$I$15:$I$1318,$J17,Calculations!AB$15:AB$1318)","v":709623.31336601917},{"$f":"-SUMIF(Calculations!$I$15:$I$1318,$J17,Calculations!AC$15:AC$1318)","v":709623.31336601917},{"$f":"-SUMIF(Calculations!$I$15:$I$1318,$J17,Calculations!AD$15:AD$1318)","v":709623.31336601917},{"$f":"-SUMIF(Calculations!$I$15:$I$1318,$J17,Calculations!AE$15:AE$1318)","v":722172.15388475568},{"$f":"-SUMIF(Calculations!$I$15:$I$1318,$J17,Calculations!AF$15:AF$1318)","v":722172.15388475568},{"$f":"-SUMIF(Calculations!$I$15:$I$1318,$J17,Calculations!AG$15:AG$1318)","v":722172.15388475568},{"$f":"-SUMIF(Calculations!$I$15:$I$1318,$J17,Calculations!AH$15:AH$1318)","v":188630.81912758446},{"$f":"-SUMIF(Calculations!$I$15:$I$1318,$J17,Calculations!AI$15:AI$1318)","v":188630.81912758446},{"$f":"-SUMIF(Calculations!$I$15:$I$1318,$J17,Calculations!AJ$15:AJ$1318)","v":188630.81912758446},{"$f":"-SUMIF(Calculations!$I$15:$I$1318,$J17,Calculations!AK$15:AK$1318)","v":0},{"$f":"-SUMIF(Calculations!$I$15:$I$1318,$J17,Calculations!AL$15:AL$1318)","v":0},{"$f":"-SUMIF(Calculations!$I$15:$I$1318,$J17,Calculations!AM$15:AM$1318)","v":0}]
[null,null,null,null,null,null,null,null,"Downgrade expense (excl rework)",{"$f":"$J$3&I18","v":"1Downgrade expense (excl rework)"},null,{"$f":"SUM(O18:AJ18)","v":0},null,null,{"$f":"-SUMIF(Calculations!$I$15:$I$1318,$J18,Calculations!R$15:R$1318)","v":0},{"$f":"-SUMIF(Calculations!$I$15:$I$1318,$J18,Calculations!S$15:S$1318)","v":0},{"$f":"-SUMIF(Calculations!$I$15:$I$1318,$J18,Calculations!T$15:T$1318)","v":0},{"$f":"-SUMIF(Calculations!$I$15:$I$1318,$J18,Calculations!U$15:U$1318)","v":0},{"$f":"-SUMIF(Calculations!$I$15:$I$1318,$J18,Calculations!V$15:V$1318)","v":0},{"$f":"-SUMIF(Calculations!$I$15:$I$1318,$J18,Calculations!W$15:W$1318)","v":0},{"$f":"-SUMIF(Calculations!$I$15:$I$1318,$J18,Calculations!X$15:X$1318)","v":0},{"$f":"-SUMIF(Calculations!$I$15:$I$1318,$J18,Calculations!Y$15:Y$1318)","v":0},{"$f":"-SUMIF(Calculations!$I$15:$I$1318,$J18,Calculations!Z$15:Z$1318)","v":0},{"$f":"-SUMIF(Calculations!$I$15:$I$1318,$J18,Calculations!AA$15:AA$1318)","v":0},{"$f":"-SUMIF(Calculations!$I$15:$I$1318,$J18,Calculations!AB$15:AB$1318)","v":0},{"$f":"-SUMIF(Calculations!$I$15:$I$1318,$J18,Calculations!AC$15:AC$1318)","v":0},{"$f":"-SUMIF(Calculations!$I$15:$I$1318,$J18,Calculations!AD$15:AD$1318)","v":0},{"$f":"-SUMIF(Calculations!$I$15:$I$1318,$J18,Calculations!AE$15:AE$1318)","v":0},{"$f":"-SUMIF(Calculations!$I$15:$I$1318,$J18,Calculations!AF$15:AF$1318)","v":0},{"$f":"-SUMIF(Calculations!$I$15:$I$1318,$J18,Calculations!AG$15:AG$1318)","v":0},{"$f":"-SUMIF(Calculations!$I$15:$I$1318,$J18,Calculations!AH$15:AH$1318)","v":0},{"$f":"-SUMIF(Calculations!$I$15:$I$1318,$J18,Calculations!AI$15:AI$1318)","v":0},{"$f":"-SUMIF(Calculations!$I$15:$I$1318,$J18,Calculations!AJ$15:AJ$1318)","v":0},{"$f":"-SUMIF(Calculations!$I$15:$I$1318,$J18,Calculations!AK$15:AK$1318)","v":0},{"$f":"-SUMIF(Calculations!$I$15:$I$1318,$J18,Calculations!AL$15:AL$1318)","v":0},{"$f":"-SUMIF(Calculations!$I$15:$I$1318,$J18,Calculations!AM$15:AM$1318)","v":0}]
[null,null,null,null,null,null,null,null,"Net Sales",null,null,{"$f":"SUM(L17:L18)","v":9133955.7940697875},null,null,{"$f":"SUM(O17:O18)","v":0},{"$f":"SUM(P17:P18)","v":0},{"$f":"SUM(Q17:Q18)","v":0},0,0,355848.72565361334,355848.72565361334,1186993.1612091614,1186993.1612091614,1186993.1612091614,709623.31336601917,709623.31336601917,709623.31336601917,722172.15388475568,722172.15388475568,722172.15388475568,188630.81912758446,188630.81912758446,188630.81912758446,0,0,0]
[null,null,null,null,null,null,null,null,"Average conversion rate (Sales)",null,null,{"$f":"Calculations!N334/Calculations!N342","v":0.7082075110462589}]
{"$rows_left_out":122}
{"sheet":"LookupTables","index":5,"n_rows":28,"n_cols":9,"rows_kept":28,"cut":false,"hidden":true,"merged":[]}
[]
[]
[]
[]
[]
[]
[]
[]
[]
[null,null,null,null,"Year to date month",null,null,null,"Selected"]
[null,null,null,null,{"$f":"Global!K32","v":"2015-06-30"},"YTD_Months",null,null,16]
[null,null,null,null,{"$f":"EOMONTH(E11,1)","v":"2015-07-31"},null,null,null,{"$f":"CHOOSE(YTD_Months_No,$E$11,$E$12,$E$13,$E$14,$E$15,$E$16,$E$17,$E$18,$E$19,$E$20,$E$21,$E$22,$E$23,$E$24,$E$25,$E$26,$E$27,$E$28)","v":"2016-09-30"}]
[null,null,null,null,{"$f":"EOMONTH(E12,1)","v":"2015-08-31"}]
[null,null,null,null,"2015-09-30"]
[null,null,null,null,"2015-10-31"]
[null,null,null,null,"2015-11-30"]
[null,null,null,null,"2015-12-31"]
[null,null,null,null,"2016-01-31"]
[null,null,null,null,"2016-02-29"]
[null,null,null,null,"2016-03-31"]
{"$rows_left_out":9}
{"sheet":"nav_inputs","index":6,"n_rows":74,"n_cols":7,"rows_kept":74,"cut":false,"hidden":true,"merged":[]}
[]
[]
[]
[]
[null,"Full","References",null,null,"Caption"]
[null,"Caption","Worksheet","Cell","Level A","Level B","Level C"]
[null,"Entities","Global","A1","Global"]
[null,{"$f":"E8&IF(F8=\"\",\"\",IF(G8=\"\",\" / \"&F8,\" / \"&F8&\" / \"&G8))","v":"Data Input / GLOBAL"},"Data Input",{"$f":"\"A\"&MATCH(F8,'Data Input'!$F$13:$F$715,0)+15","v":"A17"},"Data Input",{"$f":"'Data Input'!F14","v":"GLOBAL"}]
[null,"Data Input / MILK SUPPLY","Data Input",{"$f":"\"A\"&MATCH(F9,'Data Input'!$F$13:$F$715,0)+15","v":"A27"},"Data Input",{"$f":"'Data Input'!F24","v":"MILK SUPPLY"}]
[null,"Data Input / PRODUCTION","Data Input",{"$f":"\"A\"&MATCH(F10,'Data Input'!$F$13:$F$715,0)+15","v":"A39"},"Data Input",{"$f":"'Data Input'!F36","v":"PRODUCTION"}]
[null,"Data Input / REVENUE / 1. Base Commodity Prices","Data Input",{"$f":"\"A\"&MATCH(G11,'Data Input'!$E$13:$E$715,0)+15","v":"A86"},"Data Input",{"$f":"'Data Input'!F77","v":"REVENUE"},{"$f":"'Data Input'!E83","v":"1. Base Commodity Prices"}]
[null,{"$f":"E12&IF(F12=\"\",\"\",IF(G12=\"\",\" / \"&F12,\" / \"&F12&\" / \"&G12))","v":"Data Input / REVENUE / 2.  Sales Phasing"},"Data Input",{"$f":"\"A\"&MATCH(G12,'Data Input'!$E$13:$E$715,0)+15","v":"A100"},"Data Input",{"$f":"F11","v":"REVENUE"},{"$f":"'Data Input'!E97","v":"2.  Sales Phasing"}]
[null,{"$f":"E13&IF(F13=\"\",\"\",IF(G13=\"\",\" / \"&F13,\" / \"&F13&\" / \"&G13))","v":"Data Input / COLLECTION"},"Data Input",{"$f":"\"A\"&MATCH(F13,'Data Input'!$F$13:$F$715,0)+15","v":"A135"},"Data Input",{"$f":"'Data Input'!F132","v":"COLLECTION"}]
[null,"Data Input / OPEX","Data Input",{"$f":"\"A\"&MATCH(F14,'Data Input'!$F$13:$F$715,0)+15","v":"A146"},"Data Input",{"$f":"'Data Input'!F143","v":"OPEX"}]
[null,"Data Input / SUPPLY CHAIN","Data Input",{"$f":"\"A\"&MATCH(F15,'Data Input'!$F$13:$F$715,0)+15","v":"A192"},"Data Input",{"$f":"'Data Input'!F189","v":"SUPPLY CHAIN"}]
[null,"Data Input / ADMINISTRATION","Data Input",{"$f":"\"A\"&MATCH(F16,'Data Input'!$F$13:$F$715,0)+15","v":"A219"},"Data Input",{"$f":"'Data Input'!F216","v":"ADMINISTRATION"}]
[null,"Data Input / FIXED ASSETS","Data Input",{"$f":"\"A\"&MATCH(F17,'Data Input'!$F$13:$F$715,0)+15","v":"A232"},"Data Input",{"$f":"'Data Input'!F229","v":"FIXED ASSETS"}]
[null,"Data Input / INCOME TAX","Data Input",{"$f":"\"A\"&MATCH(F18,'Data Input'!$F$13:$F$715,0)+15","v":"A243"},"Data Input",{"$f":"'Data Input'!F240","v":"INCOME TAX"}]
[null,"Data Input / WORKING CAPITAL","Data Input",{"$f":"\"A\"&MATCH(F19,'Data Input'!$F$13:$F$715,0)+15","v":"A253"},"Data Input",{"$f":"'Data Input'!F250","v":"WORKING CAPITAL"}]
[null,"Data Input / WORKING CAPITAL","Data Input",{"$f":"\"A\"&MATCH(F20,'Data Input'!$F$13:$F$715,0)+14","v":"A252"},"Data Input",{"$f":"'Data Input'!F250","v":"WORKING CAPITAL"}]
{"$rows_left_out":54}