{"text_format":"1","workbook":"xlsx","n_sheets":9,"sheets":["_com.sap.ip.bi.xl.hiddensheet","Notice","Global","Data Input","Calculations","Summary","MP Statement Tables","LookupTables","CR&T"],"not_rendered":{"charts":0,"images":0,"macros":1,"external_links":0,"defined_names":353,"comments":0,"pivot_tables":0},"unopened":[],"bounds":{"document_bytes":16777216,"sheet_cells":100000,"rows_first":2000,"rows_last":500,"rows_between":2000,"halvings":0,"cell_chars":16384,"cell_head_chars":4096},"cells_cut":0,"cells_raw":0,"read":"whole","date_system":"1900"}

{"sheet":"_com.sap.ip.bi.xl.hiddensheet","index":0,"n_rows":0,"n_cols":0,"rows_kept":0,"cut":false,"hidden":true,"merged":[]}

{"sheet":"Notice","index":1,"n_rows":8,"n_cols":2,"rows_kept":8,"cut":false,"hidden":false,"merged":[]}
[]
[null,"1. The workbook contains the  inputs and calculations underpinning the calculation of the Farmgate Milk Price for the 2024/25 season."]
[null,"2. This workbook is the property of Fonterra Co-operative Group Limited (Fonterra)."]
[null,"3. Fonterra does not warrant that the workbook is free from error, and disclaims any liability to any third party with respect to any use they may make of the workbook."]
[null,"4. Third party recipients of this workbook use it at their own risk.  Fonterra will not accept any responsibility for any loss which may result from the use of the workbook including the direct or indirect consequences of computer viruses."]
[null,"5. The workbook was not designed for use by third parties and Fonterra provides no assurance that third parties will be able to readily operate the workbook. "]
[null,"6. Consistent with Fonterra's obligations under section 150QA of the Dairy Industry Restructuring Act 2001, the full suite of models informing the calculation of the Farmgate Milk Price for the 2024/25 season (with commercially sensitive information redacted) will be available online from 13 October 2025 at:"]
[null,"https://www.fonterra.com/nz/en/investors/farmgate-milk-price/dira-disclosures.html "]

{"sheet":"Global","index":2,"n_rows":56,"n_cols":42,"rows_kept":56,"cut":false,"hidden":false,"merged":[]}
[null,null,null,null,null,null,null,null,null,null,null,null,null,"Farmgate Milk Price"]
[null,null,null,null,null,null,null,null,null,null,"Current Milk Price",null,null,{"$f":"Summary!L131","v":10.162911688167812}]
[null,null,null,null,null,null,null,null,null,null,null,null,null,null,null,null,null,null,null,null,"Milk Price Reporting v1.05 F11 July 11 FINAL v1.xlsm 26/08/2011 3:04:22 p.m."]
[]
[]
[null,null,null,null,null,null,null,null,null,null,"Average FX conversion rate (Sales)",null,null,{"$f":"Calculations!N728/Calculations!N736","v":0.5988077291074192}]
[]
[null,null,null,null,null,"Period Ended",null,null,null,null,null,null,null,null,null,null,{"$f":"EOMONTH(T8,-1)","v":"2024-05-31"},{"$f":"EOMONTH(S8,-1)","v":"2024-04-30"},{"$f":"EOMONTH(T8,-1)","v":"2024-05-31"},{"$f":"K29","v":"2024-06-30"},{"$f":"EOMONTH(T8,1)","v":"2024-07-31"},"2024-08-31","2024-09-30","2024-10-31","2024-11-30","2024-12-31","2025-01-31","2025-02-28","2025-03-31","2025-04-30","2025-05-31","2025-06-30","2025-07-31","2025-08-31","2025-09-30","2025-10-31","2025-11-30","2025-12-31","2026-01-31","2026-02-28","2026-03-31",46142]
[null,null,null,"Calendar Year",null,null,null,null,null,null,null,null,null,null,null,null,null,null,null,{"$f":"YEAR(T8)","v":2024},2024,2024,2024,2024,2024,2024,2025,2025,2025,2025,2025,2025,2025,2025,2025,2025,2025,2025,2026,2026,2026]
[null,null,null,"Month Number",null,null,null,null,null,null,null,null,null,null,null,null,null,null,null,1,{"$f":"T10+1","v":2},3,4,5,6,7,8,9,10,11,12,13,14,15,16,17,18,19,20,21,22]
[null,null,null,"Days in Period",null,null,null,null,null,null,null,null,null,null,null,null,null,{"$f":"R8-EOMONTH(R8,-1)","v":30},{"$f":"S8-R8","v":31},{"$f":"T8-S8","v":30},{"$f":"U8-T8","v":31},31,30,31,30,31,31,28,31,30,31,30,31,31,30,31,30,31,31,28,31]
[null,null,null,"Year to date flag",null,null,null,null,null,null,null,null,null,null,null,{"$f":"LookupTables!I9","v":14},null,null,null,{"$f":"IF(T10<=$P$12,1,0)","v":1},1,1,1,1,1,1,1,1,1,1,1,1,1,0,0,0,0,0,0,0,0]
[]
[null,null,"GENERAL MODEL INPUTS"]
[]
[]
[null,null,"INPUT KEY"]
[]
[null,null,null,null,null,"Colour Key:",null,null,null,null,"Description"]
[null,null,null,null,null,null,null,null,null,null,"Data input cell."]
{"$rows_left_out":37}
{"sheet":"Data Input","index":3,"n_rows":379,"n_cols":41,"rows_kept":379,"cut":false,"hidden":false,"merged":[[43,9,44,24],[129,9,129,24]]}
[]
[]
[]
[null,null,null,null,null,{"$f":"Calculations!F5","v":"Overall error check"},null,null,null,{"$f":"IF(COUNTA(B:B)=COUNTIF(B:B,\"Okay\"),\"Okay\",\"Error\")","v":"Okay"},null,null,"Annual",null,null,null,null,null,null,"Monthly"]
[]
[null,null,null,null,null,null,null,null,null,"Units","Input",null,null,null,null,null,null,{"$f":"Global!R8","v":"2024-04-30"},{"$f":"Global!S8","v":"2024-05-31"},{"$f":"Global!T8","v":"2024-06-30"},{"$f":"Global!U8","v":"2024-07-31"},{"$f":"Global!V8","v":"2024-08-31"},{"$f":"Global!W8","v":"2024-09-30"},{"$f":"Global!X8","v":"2024-10-31"},{"$f":"Global!Y8","v":"2024-11-30"},{"$f":"Global!Z8","v":"2024-12-31"},{"$f":"Global!AA8","v":"2025-01-31"},{"$f":"Global!AB8","v":"2025-02-28"},{"$f":"Global!AC8","v":"2025-03-31"},{"$f":"Global!AD8","v":"2025-04-30"},{"$f":"Global!AE8","v":"2025-05-31"},{"$f":"Global!AF8","v":"2025-06-30"},{"$f":"Global!AG8","v":"2025-07-31"},{"$f":"Global!AH8","v":"2025-08-31"},{"$f":"Global!AI8","v":"2025-09-30"},{"$f":"Global!AJ8","v":"2025-10-31"},{"$f":"Global!AK8","v":"2025-11-30"},{"$f":"Global!AL8","v":"2025-12-31"},{"$f":"Global!AM8","v":"2026-01-31"},{"$f":"Global!AN8","v":"2026-02-28"},{"$f":"Global!AO8","v":"2026-03-31"}]
[null,null,null,"Calendar Year",null,null,null,null,null,null,null,null,null,null,null,null,null,null,null,{"$f":"YEAR(T6)","v":2024},2024,2024,2024,2024,2024,2024,{"$f":"YEAR(AA6)","v":2025},2025,2025,2025,2025,2025,2025,2025,2025,2025,2025,2025,2026,{"$f":"YEAR(AN6)","v":2026},{"$f":"YEAR(AO6)","v":2026}]
[null,null,null,"Month Number",null,null,null,null,null,null,null,null,null,null,null,null,null,null,null,{"$f":"Global!T10","v":1},{"$f":"Global!U10","v":2},{"$f":"Global!V10","v":3},{"$f":"Global!W10","v":4},{"$f":"Global!X10","v":5},{"$f":"Global!Y10","v":6},{"$f":"Global!Z10","v":7},{"$f":"Global!AA10","v":8},{"$f":"Global!AB10","v":9},{"$f":"Global!AC10","v":10},{"$f":"Global!AD10","v":11},{"$f":"Global!AE10","v":12},{"$f":"Global!AF10","v":13},{"$f":"Global!AG10","v":14},{"$f":"Global!AH10","v":15},{"$f":"Global!AI10","v":16},{"$f":"Global!AJ10","v":17},{"$f":"Global!AK10","v":18},{"$f":"Global!AL10","v":19},{"$f":"Global!AM10","v":20},{"$f":"Global!AN10","v":21},{"$f":"Global!AO10","v":22}]
[null,null,null,"Days in Period",null,null,null,null,null,null,null,null,null,null,null,null,null,{"$f":"Global!R11","v":30},{"$f":"Global!S11","v":31},{"$f":"Global!T11","v":30},{"$f":"Global!U11","v":31},{"$f":"Global!V11","v":31},{"$f":"Global!W11","v":30},{"$f":"Global!X11","v":31},{"$f":"Global!Y11","v":30},{"$f":"Global!Z11","v":31},{"$f":"Global!AA11","v":31},{"$f":"Global!AB11","v":28},{"$f":"Global!AC11","v":31},{"$f":"Global!AD11","v":30},{"$f":"Global!AE11","v":31},{"$f":"Global!AF11","v":30},{"$f":"Global!AG11","v":31},{"$f":"Global!AH11","v":31},{"$f":"Global!AI11","v":30},{"$f":"Global!AJ11","v":31},{"$f":"Global!AK11","v":30},{"$f":"Global!AL11","v":31},{"$f":"Global!AM11","v":31},{"$f":"Global!AN11","v":28},{"$f":"Global!AO11","v":31}]
[null,null,null,"Year to date flag",null,null,null,null,null,null,null,null,null,null,null,null,null,null,null,{"$f":"Global!T12","v":1},{"$f":"Global!U12","v":1},{"$f":"Global!V12","v":1},{"$f":"Global!W12","v":1},{"$f":"Global!X12","v":1},{"$f":"Global!Y12","v":1},{"$f":"Global!Z12","v":1},{"$f":"Global!AA12","v":1},{"$f":"Global!AB12","v":1},{"$f":"Global!AC12","v":1},{"$f":"Global!AD12","v":1},{"$f":"Global!AE12","v":1},{"$f":"Global!AF12","v":1},{"$f":"Global!AG12","v":1},{"$f":"Global!AH12","v":0},{"$f":"Global!AI12","v":0},{"$f":"Global!AJ12","v":0},{"$f":"Global!AK12","v":0},{"$f":"Global!AL12","v":0},{"$f":"Global!AM12","v":0},{"$f":"Global!AN12","v":0},{"$f":"Global!AO12","v":0}]
[null,null,null,null,null,null,null,null,null,null,null,null,null,null,null,null,null,null,null,{"$f":"T6","v":"2024-06-30"},"2024-07-31","2024-08-31","2024-09-30","2024-10-31","2024-11-30","2024-12-31","2025-01-31","2025-02-28","2025-03-31","2025-04-30","2025-05-31","2025-06-30","2025-07-31","2025-08-31","2025-09-30","2025-10-31","2025-11-30","2025-12-31","2026-01-31",{"$f":"AN6","v":"2026-02-28"},{"$f":"AO6","v":"2026-03-31"}]
[]
[]
[null,null,null,null,null,"GLOBAL"]
[]
[null,null,null,null,null,"Notes",null,null,null,"Weighted average annual FX rate for revenue and import costs."]
[]
[]
[null,null,null,null,null,"Exchange rate"]
[null,null,null,null,null,"Average monthly cash conversion rate",null,null,null,"USD : NZD",null,null,null,null,null,null,null,0.60380694144509672,0.60635217105305772,0.60977766450370463,0.61814928317553763,0.60447013925345627,0.60443784242641885,0.61920815613591884,0.61357905348255304,0.61390174357372174,0.59732770154796888,0.59244125546490334,0.59069015229942401,0.58687266252436898,0.59283208901836437,0.59987379192485535,0.59580296802593224,0.59763380308113356,0.59713496705842206,0.59131667222105611,0.59284691564286252,0.59284691564286252,0.59284691564286252,0.59284691564286252]
{"$rows_left_out":360}
{"sheet":"Calculations","index":4,"n_rows":1780,"n_cols":43,"rows_kept":1780,"cut":false,"hidden":false,"merged":[]}
[]
[]
[]
[]
[null,null,null,null,null,"Overall error check",null,null,null,{"$f":"IF(COUNTA(B:B)=COUNTIF(B:B,\"Okay\"),\"Okay\",\"Error\")","v":"Okay"},null,null,null,"Annual",null,null,null,null,null,"Monthly"]
[]
[]
[]
[null,null,null,null,null,null,null,null,null,"Units","Cross Reference",null,null,{"$f":"Global!O8","v":"00:00:00"},null,null,null,{"$f":"Global!R8","v":"2024-04-30"},{"$f":"Global!S8","v":"2024-05-31"},{"$f":"Global!T8","v":"2024-06-30"},{"$f":"Global!U8","v":"2024-07-31"},{"$f":"Global!V8","v":"2024-08-31"},{"$f":"Global!W8","v":"2024-09-30"},{"$f":"Global!X8","v":"2024-10-31"},{"$f":"Global!Y8","v":"2024-11-30"},{"$f":"Global!Z8","v":"2024-12-31"},{"$f":"Global!AA8","v":"2025-01-31"},{"$f":"Global!AB8","v":"2025-02-28"},{"$f":"Global!AC8","v":"2025-03-31"},{"$f":"Global!AD8","v":"2025-04-30"},{"$f":"Global!AE8","v":"2025-05-31"},{"$f":"Global!AF8","v":"2025-06-30"},{"$f":"Global!AG8","v":"2025-07-31"},{"$f":"Global!AH8","v":"2025-08-31"},{"$f":"Global!AI8","v":"2025-09-30"},{"$f":"Global!AJ8","v":"2025-10-31"},{"$f":"Global!AK8","v":"2025-11-30"},{"$f":"Global!AL8","v":"2025-12-31"},{"$f":"Global!AM8","v":"2026-01-31"},{"$f":"Global!AN8","v":"2026-02-28"},{"$f":"Global!AO8","v":"2026-03-31"},{"$f":"Global!AP8","v":"2026-04-30"},{"$f":"EOMONTH(AP9,1)","v":"2026-05-31"}]
[null,null,null,"Calendar Year",null,null,null,null,null,null,null,null,null,null,null,null,null,null,null,{"$f":"YEAR(T9)","v":2024},{"$f":"YEAR(U9)","v":2024},2024,2024,2024,2024,2024,2025,2025,2025,2025,2025,2025,2025,2025,2025,2025,2025,2025,{"$f":"YEAR(AM9)","v":2026},{"$f":"YEAR(AN9)","v":2026},{"$f":"YEAR(AO9)","v":2026},{"$f":"YEAR(AP9)","v":2026}]
[null,null,null,"Month Number",null,null,null,null,null,null,null,null,null,null,null,null,null,null,null,1,{"$f":"T11+1","v":2},{"$f":"U11+1","v":3},{"$f":"V11+1","v":4},5,6,7,8,9,10,11,12,13,14,15,16,17,18,19,{"$f":"AL11+1","v":20},{"$f":"AM11+1","v":21},{"$f":"AN11+1","v":22},{"$f":"AO11+1","v":23}]
[null,null,null,"Days in Period",null,null,null,null,null,null,null,null,null,null,null,null,null,{"$f":"Global!R11","v":30},{"$f":"Global!S11","v":31},{"$f":"Global!T11","v":30},{"$f":"U9-T9","v":31},{"$f":"V9-U9","v":31},30,31,30,31,31,28,31,30,31,30,31,31,30,31,30,31,31,28,31,30]
[null,null,null,"Year to Go flag",null,null,null,null,null,null,null,null,null,1,null,{"$f":"Global!P12","v":14},null,null,null,{"$f":"Global!T12","v":1},{"$f":"Global!U12","v":1},{"$f":"Global!V12","v":1},{"$f":"Global!W12","v":1},{"$f":"Global!X12","v":1},{"$f":"Global!Y12","v":1},{"$f":"Global!Z12","v":1},{"$f":"Global!AA12","v":1},{"$f":"Global!AB12","v":1},{"$f":"Global!AC12","v":1},{"$f":"Global!AD12","v":1},{"$f":"Global!AE12","v":1},{"$f":"Global!AF12","v":1},{"$f":"Global!AG12","v":1},{"$f":"Global!AH12","v":0},{"$f":"Global!AI12","v":0},{"$f":"Global!AJ12","v":0},{"$f":"Global!AK12","v":0},{"$f":"Global!AL12","v":0},{"$f":"Global!AM12","v":0},{"$f":"Global!AN12","v":0},{"$f":"Global!AO12","v":0},{"$f":"Global!AP12","v":0}]
[null,null,null,"PRODUCTION"]
[]
[null,null,null,"COMMENT"]
[]
[]
[]
[null,null,null,"DATA INPUT"]
{"$rows_left_out":1761}
{"sheet":"Summary","index":5,"n_rows":170,"n_cols":36,"rows_kept":170,"cut":false,"hidden":false,"merged":[]}
[]
[]
[null,null,null,null,null,null,null,null,null,1,null,"Check"]
[null,null,null,null,null,null,null,null,null,null,null,null,null,null,null,null,null,null,"MONTHLY"]
[null,null,null,null,null,null,null,null,"Period Number",null,null,null,null,null,1,1,1,{"$f":"IF(Q5=12,1,Q5+1)","v":2},3,4,5,6,7,8,9,10,11,12,1,2,3,4,5,6,7,8]
[null,null,null,null,null,null,null,null,null,null,null,null,null,null,{"$f":"Global!R33","v":"2024-04-30"},{"$f":"Global!S33","v":"2024-05-31"},{"$f":"Global!T33","v":"2024-06-30"},{"$f":"Global!U33","v":"2024-07-31"},{"$f":"Global!V33","v":"2024-08-31"},{"$f":"Global!W33","v":"2024-09-30"},{"$f":"Global!X33","v":"2024-10-31"},{"$f":"Global!Y33","v":"2024-11-30"},{"$f":"Global!Z33","v":"2024-12-31"},{"$f":"Global!AA33","v":"2025-01-31"},{"$f":"Global!AB33","v":"2025-02-28"},{"$f":"Global!AC33","v":"2025-03-31"},{"$f":"Global!AD33","v":"2025-04-30"},{"$f":"Global!AE33","v":"2025-05-31"},{"$f":"Global!AF33","v":"2025-06-30"},{"$f":"Global!AG33","v":"2025-07-31"},{"$f":"Global!AH33","v":"2025-08-31"},{"$f":"Global!AI33","v":"2025-09-30"},{"$f":"Global!AJ33","v":"2025-10-31"},{"$f":"Global!AK33","v":"2025-11-30"},{"$f":"Global!AL33","v":"2025-12-31"},{"$f":"Global!AM33","v":"2026-01-31"}]
[null,null,null,null,null,null,null,null,"Period",null,null,null,null,null,1,1,1,{"$f":"Q7+1","v":2},3,4,5,6,7,8,9,10,11,12,13,14,15,16,17,18,19,20]
[]
[null,null,null,null,null,null,null,null,"Financial Year",null,null,"2025-07-01",null,null,{"$f":"Global!R33","v":"2024-04-30"},{"$f":"Global!S33","v":"2024-05-31"},{"$f":"Global!T33","v":"2024-06-30"},{"$f":"Global!U33","v":"2024-07-31"},{"$f":"Global!V33","v":"2024-08-31"},{"$f":"Global!W33","v":"2024-09-30"},{"$f":"Global!X33","v":"2024-10-31"},{"$f":"Global!Y33","v":"2024-11-30"},{"$f":"Global!Z33","v":"2024-12-31"},{"$f":"Global!AA33","v":"2025-01-31"},{"$f":"Global!AB33","v":"2025-02-28"},{"$f":"Global!AC33","v":"2025-03-31"},{"$f":"Global!AD33","v":"2025-04-30"},{"$f":"Global!AE33","v":"2025-05-31"},{"$f":"Global!AF33","v":"2025-06-30"},{"$f":"Global!AG33","v":"2025-07-31"},{"$f":"Global!AH33","v":"2025-08-31"},{"$f":"Global!AI33","v":"2025-09-30"},{"$f":"Global!AJ33","v":"2025-10-31"},{"$f":"Global!AK33","v":"2025-11-30"},{"$f":"Global!AL33","v":"2025-12-31"},{"$f":"Global!AM33","v":"2026-01-31"}]
[null,null,null,null,null,null,null,null,"KGMS '000s "]
[null,null,null,null,null,null,null,null,"Milk Supply Paid for ",null,null,{"$f":"SUM(O11:AB11)","v":1509030.4597000012},null,null,{"$f":"SUM('Data Input'!R28,'Data Input'!R34)","v":0},{"$f":"SUM('Data Input'!S28,'Data Input'!S34)","v":0},{"$f":"SUM('Data Input'!T28,'Data Input'!T34)","v":14455.729300000006},{"$f":"SUM('Data Input'!U28,'Data Input'!U34)","v":20574.005500000083},{"$f":"SUM('Data Input'!V28,'Data Input'!V34)","v":97980.582600000038},{"$f":"SUM('Data Input'!W28,'Data Input'!W34)","v":174221.24929999991},{"$f":"SUM('Data Input'!X28,'Data Input'!X34)","v":205017.14230000047},{"$f":"SUM('Data Input'!Y28,'Data Input'!Y34)","v":191724.2667999999},{"$f":"SUM('Data Input'!Z28,'Data Input'!Z34)","v":178480.17450000002},{"$f":"SUM('Data Input'!AA28,'Data Input'!AA34)","v":165720.22700000019},{"$f":"SUM('Data Input'!AB28,'Data Input'!AB34)","v":133724.52279999998},{"$f":"SUM('Data Input'!AC28,'Data Input'!AC34)","v":134881.89300000027},{"$f":"SUM('Data Input'!AD28,'Data Input'!AD34)","v":115226.98770000009},{"$f":"SUM('Data Input'!AE28,'Data Input'!AE34)","v":77023.678900000086}]
[null,null,null,null,null,null,null,null,"Milk Supply Collected",null,null,{"$f":"SUM(O12:AB12)","v":1509007.6792000013},null,null,{"$f":"'Data Input'!R39","v":0},{"$f":"'Data Input'!S39","v":0},{"$f":"'Data Input'!T39","v":14455.729300000006},{"$f":"'Data Input'!U39","v":20574.005500000083},{"$f":"'Data Input'!V39","v":97980.582600000038},{"$f":"'Data Input'!W39","v":174221.24929999991},{"$f":"'Data Input'!X39","v":204994.36180000048},{"$f":"'Data Input'!Y39","v":191724.2667999999},{"$f":"'Data Input'!Z39","v":178480.17450000002},{"$f":"'Data Input'!AA39","v":165720.22700000019},{"$f":"'Data Input'!AB39","v":133724.52279999998},{"$f":"'Data Input'!AC39","v":134881.89300000027},{"$f":"'Data Input'!AD39","v":115226.98770000009},{"$f":"'Data Input'!AE39","v":77023.678900000086}]
[]
[null,null,null,null,null,null,null,null,"$'000"]
[]
[null,null,null,null,null,null,null,null,"NZD Revenue"]
[null,null,null,null,null,null,null,null,"Sales",{"$f":"$J$3&I17","v":"1Sales"},null,{"$f":"SUM(O17:AJ17)","v":19419672.73356948},null,null,{"$f":"-SUMIF(Calculations!$I$15:$I$1783,$J17,Calculations!R$15:R$1783)","v":0},{"$f":"-SUMIF(Calculations!$I$15:$I$1783,$J17,Calculations!S$15:S$1783)","v":0},{"$f":"-SUMIF(Calculations!$I$15:$I$1783,$J17,Calculations!T$15:T$1783)","v":0},{"$f":"-SUMIF(Calculations!$I$15:$I$1783,$J17,Calculations!U$15:U$1783)","v":0},{"$f":"-SUMIF(Calculations!$I$15:$I$1783,$J17,Calculations!V$15:V$1783)","v":62923.150682080195},{"$f":"-SUMIF(Calculations!$I$15:$I$1783,$J17,Calculations!W$15:W$1783)","v":483214.00150630041},{"$f":"-SUMIF(Calculations!$I$15:$I$1783,$J17,Calculations!X$15:X$1783)","v":1569393.3175445844},{"$f":"-SUMIF(Calculations!$I$15:$I$1783,$J17,Calculations!Y$15:Y$1783)","v":1991141.6044966781},{"$f":"-SUMIF(Calculations!$I$15:$I$1783,$J17,Calculations!Z$15:Z$1783)","v":2210743.0367415026},{"$f":"-SUMIF(Calculations!$I$15:$I$1783,$J17,Calculations!AA$15:AA$1783)","v":1975375.4916882822},{"$f":"-SUMIF(Calculations!$I$15:$I$1783,$J17,Calculations!AB$15:AB$1783)","v":2066590.97538795},{"$f":"-SUMIF(Calculations!$I$15:$I$1783,$J17,Calculations!AC$15:AC$1783)","v":1845388.3905151468},{"$f":"-SUMIF(Calculations!$I$15:$I$1783,$J17,Calculations!AD$15:AD$1783)","v":1433457.3112541044},{"$f":"-SUMIF(Calculations!$I$15:$I$1783,$J17,Calculations!AE$15:AE$1783)","v":1597527.3049182885},{"$f":"-SUMIF(Calculations!$I$15:$I$1783,$J17,Calculations!AF$15:AF$1783)","v":1545409.1292880285},{"$f":"-SUMIF(Calculations!$I$15:$I$1783,$J17,Calculations!AG$15:AG$1783)","v":1516394.9184573605},{"$f":"-SUMIF(Calculations!$I$15:$I$1783,$J17,Calculations!AH$15:AH$1783)","v":647342.52767539397},{"$f":"-SUMIF(Calculations!$I$15:$I$1783,$J17,Calculations!AI$15:AI$1783)","v":403892.64445645967},{"$f":"-SUMIF(Calculations!$I$15:$I$1783,$J17,Calculations!AJ$15:AJ$1783)","v":70878.928957322132},{"$f":"-SUMIF(Calculations!$I$15:$I$1783,$J17,Calculations!AK$15:AK$1783)","v":0},{"$f":"-SUMIF(Calculations!$I$15:$I$1783,$J17,Calculations!AL$15:AL$1783)","v":0},{"$f":"-SUMIF(Calculations!$I$15:$I$1783,$J17,Calculations!AM$15:AM$1783)","v":0}]
[null,null,null,null,null,null,null,null,"Downgrade expense (excl rework)",{"$f":"$J$3&I18","v":"1Downgrade expense (excl rework)"},null,{"$f":"SUM(O18:AJ18)","v":-13989.380764587253},null,null,{"$f":"-SUMIF(Calculations!$I$15:$I$1783,$J18,Calculations!R$15:R$1783)","v":0},{"$f":"-SUMIF(Calculations!$I$15:$I$1783,$J18,Calculations!S$15:S$1783)","v":0},{"$f":"-SUMIF(Calculations!$I$15:$I$1783,$J18,Calculations!T$15:T$1783)","v":0},{"$f":"-SUMIF(Calculations!$I$15:$I$1783,$J18,Calculations!U$15:U$1783)","v":0},{"$f":"-SUMIF(Calculations!$I$15:$I$1783,$J18,Calculations!V$15:V$1783)","v":-75.507780818496229},{"$f":"-SUMIF(Calculations!$I$15:$I$1783,$J18,Calculations!W$15:W$1783)","v":-331.8201590187349},{"$f":"-SUMIF(Calculations!$I$15:$I$1783,$J18,Calculations!X$15:X$1783)","v":-1147.5042431132333},{"$f":"-SUMIF(Calculations!$I$15:$I$1783,$J18,Calculations!Y$15:Y$1783)","v":-1386.0542532389554},{"$f":"-SUMIF(Calculations!$I$15:$I$1783,$J18,Calculations!Z$15:Z$1783)","v":-1649.3522784019601},{"$f":"-SUMIF(Calculations!$I$15:$I$1783,$J18,Calculations!AA$15:AA$1783)","v":-1501.0157129911095},{"$f":"-SUMIF(Calculations!$I$15:$I$1783,$J18,Calculations!AB$15:AB$1783)","v":-1539.1983817030441},{"$f":"-SUMIF(Calculations!$I$15:$I$1783,$J18,Calculations!AC$15:AC$1783)","v":-1322.240418529829},{"$f":"-SUMIF(Calculations!$I$15:$I$1783,$J18,Calculations!AD$15:AD$1783)","v":-1029.893805971697},{"$f":"-SUMIF(Calculations!$I$15:$I$1783,$J18,Calculations!AE$15:AE$1783)","v":-1100.2303826410844},{"$f":"-SUMIF(Calculations!$I$15:$I$1783,$J18,Calculations!AF$15:AF$1783)","v":-1020.6295362502271},{"$f":"-SUMIF(Calculations!$I$15:$I$1783,$J18,Calculations!AG$15:AG$1783)","v":-1046.2744411748383},{"$f":"-SUMIF(Calculations!$I$15:$I$1783,$J18,Calculations!AH$15:AH$1783)","v":-467.05385718229707},{"$f":"-SUMIF(Calculations!$I$15:$I$1783,$J18,Calculations!AI$15:AI$1783)","v":-301.72658459442619},{"$f":"-SUMIF(Calculations!$I$15:$I$1783,$J18,Calculations!AJ$15:AJ$1783)","v":-70.878928957322131},{"$f":"-SUMIF(Calculations!$I$15:$I$1783,$J18,Calculations!AK$15:AK$1783)","v":0},{"$f":"-SUMIF(Calculations!$I$15:$I$1783,$J18,Calculations!AL$15:AL$1783)","v":0},{"$f":"-SUMIF(Calculations!$I$15:$I$1783,$J18,Calculations!AM$15:AM$1783)","v":0}]
[null,null,null,null,null,null,null,null,"Net Sales",null,null,{"$f":"SUM(L17:L18)","v":19405683.352804892},null,null,{"$f":"SUM(O17:O18)","v":0},{"$f":"SUM(P17:P18)","v":0},{"$f":"SUM(Q17:Q18)","v":0},0,62847.642901261701,482882.18134728167,1568245.8133014711,1989755.5502434392,2209093.6844631005,1973874.4759752911,2065051.7770062468,1844066.1500966169,1432427.4174481328,1596427.0745356474,1544388.4997517783,1515348.6440161855,646875.4738182117,403590.91787186527,70808.050028364814,0,0,0]
[null,null,null,null,null,null,null,null,"Average conversion rate (Sales)",null,null,{"$f":"Calculations!N728/Calculations!N736","v":0.5988077291074192}]
{"$rows_left_out":151}
{"sheet":"MP Statement Tables","index":6,"n_rows":48,"n_cols":9,"rows_kept":48,"cut":false,"hidden":false,"merged":[]}
[]
["Appendix 4:  Milk Supplied"]
[]
[null,null,null,"Milk Supplied (million kgMS)"]
[null,"JUN TO AUG",null,{"$f":"SUM('Data Input'!T39:V39)/1000","v":133.0103174000001}]
[null,"SEP TO NOV",null,{"$f":"SUM('Data Input'!W39:Y39)/1000","v":570.93987790000028}]
[null,"DEC TO FEB",null,{"$f":"SUM('Data Input'!Z39:AB39)/1000","v":477.92492430000021}]
[null,"MAR TO MAY",null,{"$f":"SUM('Data Input'!AC39:AE39)/1000","v":327.13255960000043}]
[null,"Total",null,{"$f":"SUM(D5:D8)","v":1509.0076792000009}]
[]
["Appendix 4: Production Volumes (PRODUCTION (000 MT) OF FINISHED PRODUCT)"]
[]
[null,null,null,"WMP","SMP","Butter","AMF","BMP","Total"]
[null,"JUN TO AUG",null,{"$f":"SUM(Calculations!T541:V541)/1000","v":122.69204848894479},{"$f":"SUM(Calculations!T539:V539)/1000","v":82.04603132045068},{"$f":"SUM(Calculations!T537:V537)/1000","v":20.800900228350933},{"$f":"SUM(Calculations!T538:V538)/1000","v":23.565811900023728},{"$f":"SUM(Calculations!T540:V540)/1000","v":6.6528299694080468},{"$f":"SUM(D14:H14)","v":255.75762190717819}]
[null,"SEP TO NOV",null,{"$f":"SUM(Calculations!W541:Y541)/1000","v":710.66237927460816},{"$f":"SUM(Calculations!W539:Y539)/1000","v":223.91333916802063},{"$f":"SUM(Calculations!W537:Y537)/1000","v":98.169720086987738},{"$f":"SUM(Calculations!W538:Y538)/1000","v":49.304400317149565},{"$f":"SUM(Calculations!W540:Y540)/1000","v":14.760353959969612},{"$f":"SUM(D15:H15)","v":1096.8101928067358}]
[null,"DEC TO FEB",null,{"$f":"SUM(Calculations!Z541:AB541)/1000","v":560.35376211398091},{"$f":"SUM(Calculations!Z539:AB539)/1000","v":204.39162075155841},{"$f":"SUM(Calculations!Z537:AB537)/1000","v":90.925703144291887},{"$f":"SUM(Calculations!Z538:AB538)/1000","v":44.811047578924395},{"$f":"SUM(Calculations!Z540:AB540)/1000","v":15.011239966370633},{"$f":"SUM(D16:H16)","v":915.49337355512637}]
[null,"MAR TO MAY",null,{"$f":"SUM(Calculations!AC541:AE541)/1000","v":390.4344969075953},{"$f":"SUM(Calculations!AC539:AE539)/1000","v":127.19035676349638},{"$f":"SUM(Calculations!AC537:AE537)/1000","v":51.962975507494498},{"$f":"SUM(Calculations!AC538:AE538)/1000","v":38.770420001292202},{"$f":"SUM(Calculations!AC540:AE540)/1000","v":13.606610999305358},{"$f":"SUM(D17:H17)","v":621.9648601791838}]
[null,"Total",null,{"$f":"SUM(D14:D17)","v":1784.1426867851292},637.5413480035262,261.85929896712503,156.45167979738989,50.031034895053651,2890.0260484482242]
[]
["Appendix 5:  Sales Volumes (SHIPMENTS (000 MT) OF FINISHED PRODUCT)"]
{"$rows_left_out":29}
{"sheet":"LookupTables","index":7,"n_rows":31,"n_cols":9,"rows_kept":31,"cut":false,"hidden":true,"merged":[]}
[]
[]
[]
[]
[]
[]
[]
[null,null,null,null,"Year to date month",null,null,null,"Selected"]
[null,null,null,null,{"$f":"Global!K29","v":"2024-06-30"},"YTD_Months",null,null,14]
[null,null,null,null,{"$f":"EOMONTH(E9,1)","v":"2024-07-31"},null,null,null,{"$f":"CHOOSE(YTD_Months_No,$E$9,$E$10,$E$11,$E$12,$E$13,$E$14,$E$15,$E$16,$E$17,$E$18,$E$19,$E$20,$E$21,$E$22,$E$23,$E$24,$E$25,$E$26)","v":"2025-07-31"}]
[null,null,null,null,{"$f":"EOMONTH(E10,1)","v":"2024-08-31"}]
[null,null,null,null,"2024-09-30"]
[null,null,null,null,"2024-10-31"]
[null,null,null,null,"2024-11-30"]
[null,null,null,null,"2024-12-31"]
[null,null,null,null,"2025-01-31"]
[null,null,null,null,"2025-02-28"]
[null,null,null,null,"2025-03-31"]
[null,null,null,null,"2025-04-30"]
[null,null,null,null,"2025-05-31"]
{"$rows_left_out":12}
{"sheet":"CR&T","index":8,"n_rows":3,"n_cols":1,"rows_kept":3,"cut":false,"hidden":true,"merged":[]}
["Sent to: Commodity Risk and Trading Team"]
["Sent by: Divya Gudalore (MP Analyst)"]
["Date and Time: 30/01/2015 12.58pm"]