{"text_format":"1","workbook":"xlsx","n_sheets":7,"sheets":["Notice","Global","Data Input","Calculations","Summary","LookupTables","nav_inputs"],"not_rendered":{"charts":0,"images":3,"macros":1,"external_links":2,"defined_names":158,"comments":3,"pivot_tables":0},"unopened":[],"bounds":{"document_bytes":16777216,"sheet_cells":100000,"rows_first":2000,"rows_last":500,"rows_between":2000,"halvings":0,"cell_chars":16384,"cell_head_chars":4096},"cells_cut":0,"cells_raw":0,"read":"whole","date_system":"1900"}

{"sheet":"Notice","index":0,"n_rows":8,"n_cols":2,"rows_kept":8,"cut":false,"hidden":false,"merged":[]}
[]
[null,"DISCLAIMER"]
[]
[null,"1. This workbook is the property of Fonterra Co-operative Group Limited (Fonterra)."]
[null,"2. The workbook contains the higher level inputs and calculations underpinning the calculation of the Farmgate Milk Price for the 2022/23 season."]
[null,"3. Fonterra does not warrant that the workbook is free from error, and explicitly disclaims any liability to any third party with respect to any use they may make of the workbook."]
[null,"4. Third party recipients of this workbook use it entirely at their own risk.  Fonterra will not accept any responsibility for any loss which may result from the use of the workbook including the direct or indirect consequences of computer viruses."]
[null,"5. The workbook was not designed for use by third parties and Fonterra provides no assurance that third parties will be able to readily operate the workbook. "]

{"sheet":"Global","index":1,"n_rows":58,"n_cols":44,"rows_kept":58,"cut":false,"hidden":false,"merged":[]}
[null,null,null,null,null,null,null,null,null,null,"F23 Milk Price",null,null,{"$f":"Summary!L110","v":8.2167087612903558}]
[null,null,null,null,null,null,null,null,null,null,"Average FX conversion rate (Sales)",null,null,{"$f":"Summary!L20","v":0.63573616961270585}]
[]
[]
[]
[]
[null,null,null,null,null,"Period Ended",null,null,null,null,null,null,null,null,{"$f":"K34","v":"2023-05-31"},null,{"$f":"EOMONTH(T7,-1)","v":"2022-05-31"},{"$f":"EOMONTH(S7,-1)","v":"2022-04-30"},{"$f":"EOMONTH(T7,-1)","v":"2022-05-31"},{"$f":"K32","v":"2022-06-30"},{"$f":"EOMONTH(T7,1)","v":"2022-07-31"},"2022-08-31","2022-09-30","2022-10-31","2022-11-30","2022-12-31","2023-01-31","2023-02-28","2023-03-31","2023-04-30","2023-05-31","2023-06-30","2023-07-31","2023-08-31","2023-09-30","2023-10-31","2023-11-30","2023-12-31","2024-01-31","2024-02-29","2024-03-31",{"$f":"EOMONTH(AO7,1)","v":"2024-04-30"},{"$f":"EOMONTH(AP7,1)","v":"2024-05-31"},{"$f":"EOMONTH(AQ7,1)","v":"2024-06-30"}]
[null,null,null,"Calendar Year",null,null,null,null,null,null,null,null,null,null,null,null,null,null,null,{"$f":"YEAR(T7)","v":2022},2022,2022,2022,2022,2022,2022,2023,2023,2023,2023,2023,2023,2023,2023,2023,2023,2023,2023,2024,2024,2024]
[null,null,null,"Month Number",null,null,null,null,null,null,null,null,null,null,null,null,null,null,null,1,{"$f":"T9+1","v":2},3,4,5,6,7,8,9,10,11,12,13,14,15,16,17,18,19,20,21,22]
[null,null,null,"Days in Period",null,null,null,null,null,null,null,null,null,null,null,null,null,{"$f":"R7-EOMONTH(R7,-1)","v":30},{"$f":"S7-R7","v":31},{"$f":"T7-S7","v":30},{"$f":"U7-T7","v":31},31,30,31,30,31,31,28,31,30,31,30,31,31,30,31,30,31,31,29,31]
[null,null,null,"Year to Go flag",null,null,null,null,null,null,null,null,null,null,{"$f":"INDEX(LookupTables!E11:E28,LookupTables!I11)","v":"2023-11-30"},{"$f":"LookupTables!I11","v":18},null,null,null,{"$f":"IF(T9<=$P$11,1,0)","v":1},1,1,1,1,1,1,1,1,1,1,1,1,1,1,1,1,1,0,0,0,0]
[]
[null,null,"GENERAL MODEL INPUTS"]
[]
[null,null,"MODEL INFORMATION"]
[]
[null,null,"This model contains circular logic relating to the calculation of tax expense and net working capital.  It is therefore necessary to set the calculation approach to 'iterative calculations.'"]
[]
[]
[null,null,"INPUT KEY"]
{"$rows_left_out":39}
{"sheet":"Data Input","index":2,"n_rows":281,"n_cols":41,"rows_kept":281,"cut":false,"hidden":false,"merged":[]}
[]
[]
[]
[null,null,null,null,null,{"$f":"Calculations!F5","v":"Overall error check"},null,null,null,{"$f":"IF(COUNTA(B:B)=COUNTIF(B:B,\"Okay\"),\"Okay\",\"Error\")","v":"Okay"},null,null,"Annual",null,null,null,null,null,null,"Monthly"]
[]
[null,null,null,null,null,null,null,null,null,"Units","Input",null,null,{"$f":"Global!O7","v":"2023-05-31"},null,null,null,{"$f":"Global!R7","v":"2022-04-30"},{"$f":"Global!S7","v":"2022-05-31"},{"$f":"Global!T7","v":"2022-06-30"},{"$f":"Global!U7","v":"2022-07-31"},{"$f":"Global!V7","v":"2022-08-31"},{"$f":"Global!W7","v":"2022-09-30"},{"$f":"Global!X7","v":"2022-10-31"},{"$f":"Global!Y7","v":"2022-11-30"},{"$f":"Global!Z7","v":"2022-12-31"},{"$f":"Global!AA7","v":"2023-01-31"},{"$f":"Global!AB7","v":"2023-02-28"},{"$f":"Global!AC7","v":"2023-03-31"},{"$f":"Global!AD7","v":"2023-04-30"},{"$f":"Global!AE7","v":"2023-05-31"},{"$f":"Global!AF7","v":"2023-06-30"},{"$f":"Global!AG7","v":"2023-07-31"},{"$f":"Global!AH7","v":"2023-08-31"},{"$f":"Global!AI7","v":"2023-09-30"},{"$f":"Global!AJ7","v":"2023-10-31"},{"$f":"Global!AK7","v":"2023-11-30"},{"$f":"Global!AL7","v":"2023-12-31"},{"$f":"Global!AM7","v":"2024-01-31"},{"$f":"Global!AN7","v":"2024-02-29"},{"$f":"Global!AO7","v":"2024-03-31"}]
[null,null,null,"Calendar Year",null,null,null,null,null,null,null,null,null,null,null,null,null,null,null,{"$f":"YEAR(T6)","v":2022},2022,2022,2022,2022,2022,2022,{"$f":"YEAR(AA6)","v":2023},2023,2023,2023,2023,2023,2023,2023,2023,2023,2023,2023,2024,{"$f":"YEAR(AN6)","v":2024},{"$f":"YEAR(AO6)","v":2024}]
[null,null,null,"Month Number",null,null,null,null,null,null,null,null,null,null,null,null,null,null,null,{"$f":"Global!T9","v":1},{"$f":"Global!U9","v":2},{"$f":"Global!V9","v":3},{"$f":"Global!W9","v":4},{"$f":"Global!X9","v":5},{"$f":"Global!Y9","v":6},{"$f":"Global!Z9","v":7},{"$f":"Global!AA9","v":8},{"$f":"Global!AB9","v":9},{"$f":"Global!AC9","v":10},{"$f":"Global!AD9","v":11},{"$f":"Global!AE9","v":12},{"$f":"Global!AF9","v":13},{"$f":"Global!AG9","v":14},{"$f":"Global!AH9","v":15},{"$f":"Global!AI9","v":16},{"$f":"Global!AJ9","v":17},{"$f":"Global!AK9","v":18},{"$f":"Global!AL9","v":19},{"$f":"Global!AM9","v":20},{"$f":"Global!AN9","v":21},{"$f":"Global!AO9","v":22}]
[null,null,null,"Days in Period",null,null,null,null,null,null,null,null,null,null,null,null,null,{"$f":"Global!R10","v":30},{"$f":"Global!S10","v":31},{"$f":"Global!T10","v":30},{"$f":"Global!U10","v":31},{"$f":"Global!V10","v":31},{"$f":"Global!W10","v":30},{"$f":"Global!X10","v":31},{"$f":"Global!Y10","v":30},{"$f":"Global!Z10","v":31},{"$f":"Global!AA10","v":31},{"$f":"Global!AB10","v":28},{"$f":"Global!AC10","v":31},{"$f":"Global!AD10","v":30},{"$f":"Global!AE10","v":31},{"$f":"Global!AF10","v":30},{"$f":"Global!AG10","v":31},{"$f":"Global!AH10","v":31},{"$f":"Global!AI10","v":30},{"$f":"Global!AJ10","v":31},{"$f":"Global!AK10","v":30},{"$f":"Global!AL10","v":31},{"$f":"Global!AM10","v":31},{"$f":"Global!AN10","v":29},{"$f":"Global!AO10","v":31}]
[null,null,null,"Year to Go flag",null,null,null,null,null,null,null,null,null,1,null,{"$f":"Global!P11","v":18},null,null,null,{"$f":"Global!T11","v":1},{"$f":"Global!U11","v":1},{"$f":"Global!V11","v":1},{"$f":"Global!W11","v":1},{"$f":"Global!X11","v":1},{"$f":"Global!Y11","v":1},{"$f":"Global!Z11","v":1},{"$f":"Global!AA11","v":1},{"$f":"Global!AB11","v":1},{"$f":"Global!AC11","v":1},{"$f":"Global!AD11","v":1},{"$f":"Global!AE11","v":1},{"$f":"Global!AF11","v":1},{"$f":"Global!AG11","v":1},{"$f":"Global!AH11","v":1},{"$f":"Global!AI11","v":1},{"$f":"Global!AJ11","v":1},{"$f":"Global!AK11","v":1},{"$f":"Global!AL11","v":0},{"$f":"Global!AM11","v":0},{"$f":"Global!AN11","v":0},{"$f":"Global!AO11","v":0}]
[null,null,null,null,null,null,null,null,null,null,null,null,null,null,null,null,null,null,null,{"$f":"T6","v":"2022-06-30"},"2022-07-31","2022-08-31","2022-09-30","2022-10-31","2022-11-30","2022-12-31","2023-01-31","2023-02-28","2023-03-31","2023-04-30","2023-05-31","2023-06-30","2023-07-31","2023-08-31","2023-09-30","2023-10-31","2023-11-30","2023-12-31","2024-01-31",{"$f":"AN6","v":"2024-02-29"},{"$f":"AO6","v":"2024-03-31"}]
[]
[]
[null,null,null,null,null,"GLOBAL"]
[]
[null,null,null,null,null,"STATUS / DATA SOURCE",null,null,null,"Weighted average annual FX rate for revenue.  Also used in this simplified model to translate costs.  In practice, USD purchases have a different time profile, & therefore weighted average conversion rate, to sales."]
[null,null,null,null,null,null,null,null,null,"We have adjusted the USD cost inputs to correct for this difference (so reported NZD values reconcile to the actual F23 milk price calculation.)"]
[]
[]
[null,null,null,null,null,"FX"]
{"$rows_left_out":262}
{"sheet":"Calculations","index":3,"n_rows":1341,"n_cols":43,"rows_kept":1341,"cut":false,"hidden":false,"merged":[[149,3,181,3],[58,3,147,3],[184,3,231,3]]}
[]
[]
[]
[]
[null,null,null,null,null,"Overall error check",null,null,null,{"$f":"IF(COUNTA(B:B)=COUNTIF(B:B,\"Okay\"),\"Okay\",\"Error\")","v":"Okay"},null,null,null,"Annual",null,null,null,null,null,"Monthly"]
[]
[]
[]
[null,null,null,null,null,null,null,null,null,"Units","Cross Reference",null,null,{"$f":"Global!O7","v":"2023-05-31"},null,null,null,{"$f":"Global!R7","v":"2022-04-30"},{"$f":"Global!S7","v":"2022-05-31"},{"$f":"Global!T7","v":"2022-06-30"},{"$f":"Global!U7","v":"2022-07-31"},{"$f":"Global!V7","v":"2022-08-31"},{"$f":"Global!W7","v":"2022-09-30"},{"$f":"Global!X7","v":"2022-10-31"},{"$f":"Global!Y7","v":"2022-11-30"},{"$f":"Global!Z7","v":"2022-12-31"},{"$f":"Global!AA7","v":"2023-01-31"},{"$f":"Global!AB7","v":"2023-02-28"},{"$f":"Global!AC7","v":"2023-03-31"},{"$f":"Global!AD7","v":"2023-04-30"},{"$f":"Global!AE7","v":"2023-05-31"},{"$f":"Global!AF7","v":"2023-06-30"},{"$f":"Global!AG7","v":"2023-07-31"},{"$f":"Global!AH7","v":"2023-08-31"},{"$f":"Global!AI7","v":"2023-09-30"},{"$f":"Global!AJ7","v":"2023-10-31"},{"$f":"Global!AK7","v":"2023-11-30"},{"$f":"Global!AL7","v":"2023-12-31"},{"$f":"Global!AM7","v":"2024-01-31"},{"$f":"Global!AN7","v":"2024-02-29"},{"$f":"Global!AO7","v":"2024-03-31"},{"$f":"Global!AP7","v":"2024-04-30"},{"$f":"Global!AQ7","v":"2024-05-31"}]
[null,null,null,"Calendar Year",null,null,null,null,null,null,null,null,null,null,null,null,null,null,null,{"$f":"YEAR(T9)","v":2022},{"$f":"YEAR(U9)","v":2022},2022,2022,2022,2022,2022,2023,2023,2023,2023,2023,2023,2023,2023,2023,2023,2023,2023,{"$f":"YEAR(AM9)","v":2024},{"$f":"YEAR(AN9)","v":2024},{"$f":"YEAR(AO9)","v":2024},{"$f":"YEAR(AP9)","v":2024}]
[null,null,null,"Month Number",null,null,null,null,null,null,null,null,null,null,null,null,null,null,null,1,{"$f":"T11+1","v":2},{"$f":"U11+1","v":3},{"$f":"V11+1","v":4},5,6,7,8,9,10,11,12,13,14,15,16,17,18,19,{"$f":"AL11+1","v":20},{"$f":"AM11+1","v":21},{"$f":"AN11+1","v":22},{"$f":"AO11+1","v":23}]
[null,null,null,"Days in Period",null,null,null,null,null,null,null,null,null,null,null,null,null,{"$f":"Global!R10","v":30},{"$f":"Global!S10","v":31},{"$f":"Global!T10","v":30},{"$f":"U9-T9","v":31},{"$f":"V9-U9","v":31},30,31,30,31,31,28,31,30,31,30,31,31,30,31,30,31,31,29,31,30]
[null,null,null,"Year to Go flag",null,null,null,null,null,null,null,null,null,1,null,{"$f":"Global!P11","v":18},null,null,null,{"$f":"Global!T11","v":1},{"$f":"Global!U11","v":1},{"$f":"Global!V11","v":1},{"$f":"Global!W11","v":1},{"$f":"Global!X11","v":1},{"$f":"Global!Y11","v":1},{"$f":"Global!Z11","v":1},{"$f":"Global!AA11","v":1},{"$f":"Global!AB11","v":1},{"$f":"Global!AC11","v":1},{"$f":"Global!AD11","v":1},{"$f":"Global!AE11","v":1},{"$f":"Global!AF11","v":1},{"$f":"Global!AG11","v":1},{"$f":"Global!AH11","v":1},{"$f":"Global!AI11","v":1},{"$f":"Global!AJ11","v":1},{"$f":"Global!AK11","v":1},{"$f":"Global!AL11","v":0},{"$f":"Global!AM11","v":0},{"$f":"Global!AN11","v":0},{"$f":"Global!AO11","v":0}]
[null,null,null,"PRODUCTION"]
[]
[null,null,null,"COMMENT",null,"See comments below.   Production volumes to model have been hardcoded to align to actual volumes.  Detail of loss assumptions & specification offsets, which is confidential to Fonterra, is required to"]
[null,null,null,null,null,"flow milk supply through yield logic.  Logic has however been retained in the model, and we have disclosed overall valued component usages by RCP (in cells O59:P63).  These incorporate the "]
[null,null,null,null,null,"valued component usages of the unstandardised products manufactured in October and November. "]
[]
[null,null,null,"DATA INPUT"]
{"$rows_left_out":1322}
{"sheet":"Summary","index":4,"n_rows":147,"n_cols":36,"rows_kept":147,"cut":false,"hidden":false,"merged":[]}
[]
[]
[null,null,null,null,null,null,null,null,null,1]
[null,null,null,null,null,null,null,null,null,null,null,null,null,null,null,null,null,null,"MONTHLY"]
[null,null,null,null,null,null,null,null,"Period Number",null,null,null,null,null,1,1,1,{"$f":"IF(Q5=12,1,Q5+1)","v":2},3,4,5,6,7,8,9,10,11,12,1,2,3,4,5,6,7,8]
[null,null,null,null,null,null,null,null,null,null,null,null,null,null,{"$f":"Global!R36","v":"2022-04-30"},{"$f":"Global!S36","v":"2022-05-31"},{"$f":"Global!T36","v":"2022-06-30"},{"$f":"Global!U36","v":"2022-07-31"},{"$f":"Global!V36","v":"2022-08-31"},{"$f":"Global!W36","v":"2022-09-30"},{"$f":"Global!X36","v":"2022-10-31"},{"$f":"Global!Y36","v":"2022-11-30"},{"$f":"Global!Z36","v":"2022-12-31"},{"$f":"Global!AA36","v":"2023-01-31"},{"$f":"Global!AB36","v":"2023-02-28"},{"$f":"Global!AC36","v":"2023-03-31"},{"$f":"Global!AD36","v":"2023-04-30"},{"$f":"Global!AE36","v":"2023-05-31"},{"$f":"Global!AF36","v":"2023-06-30"},{"$f":"Global!AG36","v":"2023-07-31"},{"$f":"Global!AH36","v":"2023-08-31"},{"$f":"Global!AI36","v":"2023-09-30"},{"$f":"Global!AJ36","v":"2023-10-31"},{"$f":"Global!AK36","v":"2023-11-30"},{"$f":"Global!AL36","v":"2023-12-31"},{"$f":"Global!AM36","v":"2024-01-31"}]
[null,null,null,null,null,null,null,null,"Period",null,null,null,null,null,1,1,1,{"$f":"Q7+1","v":2},3,4,5,6,7,8,9,10,11,12,13,14,15,16,17,18,19,20]
[]
[null,null,null,null,null,null,null,null,"Financial Year",null,null,{"$f":"Global!O7","v":"2023-05-31"},null,null,{"$f":"Global!R36","v":"2022-04-30"},{"$f":"Global!S36","v":"2022-05-31"},{"$f":"Global!T36","v":"2022-06-30"},{"$f":"Global!U36","v":"2022-07-31"},{"$f":"Global!V36","v":"2022-08-31"},{"$f":"Global!W36","v":"2022-09-30"},{"$f":"Global!X36","v":"2022-10-31"},{"$f":"Global!Y36","v":"2022-11-30"},{"$f":"Global!Z36","v":"2022-12-31"},{"$f":"Global!AA36","v":"2023-01-31"},{"$f":"Global!AB36","v":"2023-02-28"},{"$f":"Global!AC36","v":"2023-03-31"},{"$f":"Global!AD36","v":"2023-04-30"},{"$f":"Global!AE36","v":"2023-05-31"},{"$f":"Global!AF36","v":"2023-06-30"},{"$f":"Global!AG36","v":"2023-07-31"},{"$f":"Global!AH36","v":"2023-08-31"},{"$f":"Global!AI36","v":"2023-09-30"},{"$f":"Global!AJ36","v":"2023-10-31"},{"$f":"Global!AK36","v":"2023-11-30"},{"$f":"Global!AL36","v":"2023-12-31"},{"$f":"Global!AM36","v":"2024-01-31"}]
[null,null,null,null,null,null,null,null,"KGMS 000s "]
[null,null,null,null,null,null,null,null,"Milk Supply Paid for ",null,null,{"$f":"SUM(O11:AB11)","v":1482585.7080999999},null,null,{"$f":"'Data Input'!R31","v":0},{"$f":"'Data Input'!S31","v":0},{"$f":"'Data Input'!T31","v":14913.131600000008},{"$f":"'Data Input'!U31","v":19030.044499999989},{"$f":"'Data Input'!V31","v":91896.8964000001},{"$f":"'Data Input'!W31","v":166274.22930000033},{"$f":"'Data Input'!X31","v":200564.08249999979},{"$f":"'Data Input'!Y31","v":188167.15819999983},{"$f":"'Data Input'!Z31","v":173968.60109999948},{"$f":"'Data Input'!AA31","v":161402.50400000013},{"$f":"'Data Input'!AB31","v":130738.87569999986},{"$f":"'Data Input'!AC31","v":138233.52640000021},{"$f":"'Data Input'!AD31","v":121187.2426},{"$f":"'Data Input'!AE31","v":76209.415799999959}]
[null,null,null,null,null,null,null,null,"Milk Supply Collected",null,null,{"$f":"SUM(O12:AB12)","v":1480305.6963999998},null,null,{"$f":"'Data Input'!R32","v":0},{"$f":"'Data Input'!S32","v":0},{"$f":"'Data Input'!T32","v":14913.131600000008},{"$f":"'Data Input'!U32","v":19023.382599999986},{"$f":"'Data Input'!V32","v":91740.647400000104},{"$f":"'Data Input'!W32","v":166274.22930000033},{"$f":"'Data Input'!X32","v":200558.41309999977},{"$f":"'Data Input'!Y32","v":188167.15819999983},{"$f":"'Data Input'!Z32","v":173968.60109999948},{"$f":"'Data Input'!AA32","v":161356.94830000013},{"$f":"'Data Input'!AB32","v":129957.86049999986},{"$f":"'Data Input'!AC32","v":137733.00330000019},{"$f":"'Data Input'!AD32","v":120726.3256},{"$f":"'Data Input'!AE32","v":75885.995399999956}]
[]
[null,null,null,null,null,null,null,null,"$'000"]
[]
[null,null,null,null,null,null,null,null,"NZD Revenue"]
[null,null,null,null,null,null,null,null,"Sales",{"$f":"$J$3&I17","v":"1Sales"},null,{"$f":"SUM(O17:AJ17)","v":16158839.369252473},null,null,{"$f":"-SUMIF(Calculations!$I$15:$I$1344,$J17,Calculations!R$15:R$1344)","v":0},{"$f":"-SUMIF(Calculations!$I$15:$I$1344,$J17,Calculations!S$15:S$1344)","v":0},{"$f":"-SUMIF(Calculations!$I$15:$I$1344,$J17,Calculations!T$15:T$1344)","v":0},{"$f":"-SUMIF(Calculations!$I$15:$I$1344,$J17,Calculations!U$15:U$1344)","v":0},{"$f":"-SUMIF(Calculations!$I$15:$I$1344,$J17,Calculations!V$15:V$1344)","v":0},{"$f":"-SUMIF(Calculations!$I$15:$I$1344,$J17,Calculations!W$15:W$1344)","v":837115.36774837086},{"$f":"-SUMIF(Calculations!$I$15:$I$1344,$J17,Calculations!X$15:X$1344)","v":837115.36774837086},{"$f":"-SUMIF(Calculations!$I$15:$I$1344,$J17,Calculations!Y$15:Y$1344)","v":1831421.3838443444},{"$f":"-SUMIF(Calculations!$I$15:$I$1344,$J17,Calculations!Z$15:Z$1344)","v":1831421.3838443444},{"$f":"-SUMIF(Calculations!$I$15:$I$1344,$J17,Calculations!AA$15:AA$1344)","v":1831421.3838443444},{"$f":"-SUMIF(Calculations!$I$15:$I$1344,$J17,Calculations!AB$15:AB$1344)","v":1386083.3286003172},{"$f":"-SUMIF(Calculations!$I$15:$I$1344,$J17,Calculations!AC$15:AC$1344)","v":1386083.3286003172},{"$f":"-SUMIF(Calculations!$I$15:$I$1344,$J17,Calculations!AD$15:AD$1344)","v":1386083.3286003177},{"$f":"-SUMIF(Calculations!$I$15:$I$1344,$J17,Calculations!AE$15:AE$1344)","v":1347714.6275948286},{"$f":"-SUMIF(Calculations!$I$15:$I$1344,$J17,Calculations!AF$15:AF$1344)","v":1347714.6275948286},{"$f":"-SUMIF(Calculations!$I$15:$I$1344,$J17,Calculations!AG$15:AG$1344)","v":1347714.6275948286},{"$f":"-SUMIF(Calculations!$I$15:$I$1344,$J17,Calculations!AH$15:AH$1344)","v":262983.53787908662},{"$f":"-SUMIF(Calculations!$I$15:$I$1344,$J17,Calculations!AI$15:AI$1344)","v":262983.53787908662},{"$f":"-SUMIF(Calculations!$I$15:$I$1344,$J17,Calculations!AJ$15:AJ$1344)","v":262983.53787908662},{"$f":"-SUMIF(Calculations!$I$15:$I$1344,$J17,Calculations!AK$15:AK$1344)","v":0},{"$f":"-SUMIF(Calculations!$I$15:$I$1344,$J17,Calculations!AL$15:AL$1344)","v":0},{"$f":"-SUMIF(Calculations!$I$15:$I$1344,$J17,Calculations!AM$15:AM$1344)","v":0}]
[null,null,null,null,null,null,null,null,"Downgrade expense (excl rework)",{"$f":"$J$3&I18","v":"1Downgrade expense (excl rework)"},null,{"$f":"SUM(O18:AJ18)","v":0},null,null,{"$f":"-SUMIF(Calculations!$I$15:$I$1344,$J18,Calculations!R$15:R$1344)","v":0},{"$f":"-SUMIF(Calculations!$I$15:$I$1344,$J18,Calculations!S$15:S$1344)","v":0},{"$f":"-SUMIF(Calculations!$I$15:$I$1344,$J18,Calculations!T$15:T$1344)","v":0},{"$f":"-SUMIF(Calculations!$I$15:$I$1344,$J18,Calculations!U$15:U$1344)","v":0},{"$f":"-SUMIF(Calculations!$I$15:$I$1344,$J18,Calculations!V$15:V$1344)","v":0},{"$f":"-SUMIF(Calculations!$I$15:$I$1344,$J18,Calculations!W$15:W$1344)","v":0},{"$f":"-SUMIF(Calculations!$I$15:$I$1344,$J18,Calculations!X$15:X$1344)","v":0},{"$f":"-SUMIF(Calculations!$I$15:$I$1344,$J18,Calculations!Y$15:Y$1344)","v":0},{"$f":"-SUMIF(Calculations!$I$15:$I$1344,$J18,Calculations!Z$15:Z$1344)","v":0},{"$f":"-SUMIF(Calculations!$I$15:$I$1344,$J18,Calculations!AA$15:AA$1344)","v":0},{"$f":"-SUMIF(Calculations!$I$15:$I$1344,$J18,Calculations!AB$15:AB$1344)","v":0},{"$f":"-SUMIF(Calculations!$I$15:$I$1344,$J18,Calculations!AC$15:AC$1344)","v":0},{"$f":"-SUMIF(Calculations!$I$15:$I$1344,$J18,Calculations!AD$15:AD$1344)","v":0},{"$f":"-SUMIF(Calculations!$I$15:$I$1344,$J18,Calculations!AE$15:AE$1344)","v":0},{"$f":"-SUMIF(Calculations!$I$15:$I$1344,$J18,Calculations!AF$15:AF$1344)","v":0},{"$f":"-SUMIF(Calculations!$I$15:$I$1344,$J18,Calculations!AG$15:AG$1344)","v":0},{"$f":"-SUMIF(Calculations!$I$15:$I$1344,$J18,Calculations!AH$15:AH$1344)","v":0},{"$f":"-SUMIF(Calculations!$I$15:$I$1344,$J18,Calculations!AI$15:AI$1344)","v":0},{"$f":"-SUMIF(Calculations!$I$15:$I$1344,$J18,Calculations!AJ$15:AJ$1344)","v":0},{"$f":"-SUMIF(Calculations!$I$15:$I$1344,$J18,Calculations!AK$15:AK$1344)","v":0},{"$f":"-SUMIF(Calculations!$I$15:$I$1344,$J18,Calculations!AL$15:AL$1344)","v":0},{"$f":"-SUMIF(Calculations!$I$15:$I$1344,$J18,Calculations!AM$15:AM$1344)","v":0}]
[null,null,null,null,null,null,null,null,"Net Sales",null,null,{"$f":"SUM(L17:L18)","v":16158839.369252473},null,null,{"$f":"SUM(O17:O18)","v":0},{"$f":"SUM(P17:P18)","v":0},{"$f":"SUM(Q17:Q18)","v":0},0,0,837115.36774837086,837115.36774837086,1831421.3838443444,1831421.3838443444,1831421.3838443444,1386083.3286003172,1386083.3286003172,1386083.3286003177,1347714.6275948286,1347714.6275948286,1347714.6275948286,262983.53787908662,262983.53787908662,262983.53787908662,0,0,0]
[null,null,null,null,null,null,null,null,"Average conversion rate (Sales)",null,null,{"$f":"Calculations!N350/Calculations!N358","v":0.63573616961270585}]
{"$rows_left_out":128}
{"sheet":"LookupTables","index":5,"n_rows":28,"n_cols":9,"rows_kept":28,"cut":false,"hidden":true,"merged":[]}
[]
[]
[]
[]
[]
[]
[]
[]
[]
[null,null,null,null,"Year to date month",null,null,null,"Selected"]
[null,null,null,null,{"$f":"Global!K32","v":"2022-06-30"},"YTD_Months",null,null,18]
[null,null,null,null,{"$f":"EOMONTH(E11,1)","v":"2022-07-31"},null,null,null,{"$f":"CHOOSE(YTD_Months_No,$E$11,$E$12,$E$13,$E$14,$E$15,$E$16,$E$17,$E$18,$E$19,$E$20,$E$21,$E$22,$E$23,$E$24,$E$25,$E$26,$E$27,$E$28)","v":"2023-11-30"}]
[null,null,null,null,{"$f":"EOMONTH(E12,1)","v":"2022-08-31"}]
[null,null,null,null,"2022-09-30"]
[null,null,null,null,"2022-10-31"]
[null,null,null,null,"2022-11-30"]
[null,null,null,null,"2022-12-31"]
[null,null,null,null,"2023-01-31"]
[null,null,null,null,"2023-02-28"]
[null,null,null,null,"2023-03-31"]
{"$rows_left_out":9}
{"sheet":"nav_inputs","index":6,"n_rows":74,"n_cols":7,"rows_kept":74,"cut":false,"hidden":true,"merged":[]}
[]
[]
[]
[]
[null,"Full","References",null,null,"Caption"]
[null,"Caption","Worksheet","Cell","Level A","Level B","Level C"]
[null,"Entities","Global","A1","Global"]
[null,{"$f":"E8&IF(F8=\"\",\"\",IF(G8=\"\",\" / \"&F8,\" / \"&F8&\" / \"&G8))","v":"Data Input / GLOBAL"},"Data Input",{"$f":"\"A\"&MATCH(F8,'Data Input'!$F$13:$F$719,0)+15","v":"A17"},"Data Input",{"$f":"'Data Input'!F14","v":"GLOBAL"}]
[null,"Data Input / MILK SUPPLY","Data Input",{"$f":"\"A\"&MATCH(F9,'Data Input'!$F$13:$F$719,0)+15","v":"A27"},"Data Input",{"$f":"'Data Input'!F24","v":"MILK SUPPLY"}]
[null,"Data Input / PRODUCTION","Data Input",{"$f":"\"A\"&MATCH(F10,'Data Input'!$F$13:$F$719,0)+15","v":"A39"},"Data Input",{"$f":"'Data Input'!F36","v":"PRODUCTION"}]
[null,"Data Input / REVENUE / 1. Base Commodity Prices","Data Input",{"$f":"\"A\"&MATCH(G11,'Data Input'!$E$13:$E$719,0)+15","v":"A86"},"Data Input",{"$f":"'Data Input'!F77","v":"REVENUE"},{"$f":"'Data Input'!E83","v":"1. Base Commodity Prices"}]
[null,{"$f":"E12&IF(F12=\"\",\"\",IF(G12=\"\",\" / \"&F12,\" / \"&F12&\" / \"&G12))","v":"Data Input / REVENUE / 2.  Sales Phasing"},"Data Input",{"$f":"\"A\"&MATCH(G12,'Data Input'!$E$13:$E$719,0)+15","v":"A101"},"Data Input",{"$f":"F11","v":"REVENUE"},{"$f":"'Data Input'!E98","v":"2.  Sales Phasing"}]
[null,{"$f":"E13&IF(F13=\"\",\"\",IF(G13=\"\",\" / \"&F13,\" / \"&F13&\" / \"&G13))","v":"Data Input / COLLECTION"},"Data Input",{"$f":"\"A\"&MATCH(F13,'Data Input'!$F$13:$F$719,0)+15","v":"A136"},"Data Input",{"$f":"'Data Input'!F133","v":"COLLECTION"}]
[null,"Data Input / OPEX","Data Input",{"$f":"\"A\"&MATCH(F14,'Data Input'!$F$13:$F$719,0)+15","v":"A147"},"Data Input",{"$f":"'Data Input'!F144","v":"OPEX"}]
[null,"Data Input / SUPPLY CHAIN","Data Input",{"$f":"\"A\"&MATCH(F15,'Data Input'!$F$13:$F$719,0)+15","v":"A194"},"Data Input",{"$f":"'Data Input'!F191","v":"SUPPLY CHAIN"}]
[null,"Data Input / ADMINISTRATION","Data Input",{"$f":"\"A\"&MATCH(F16,'Data Input'!$F$13:$F$719,0)+15","v":"A221"},"Data Input",{"$f":"'Data Input'!F218","v":"ADMINISTRATION"}]
[null,"Data Input / FIXED ASSETS","Data Input",{"$f":"\"A\"&MATCH(F17,'Data Input'!$F$13:$F$719,0)+15","v":"A234"},"Data Input",{"$f":"'Data Input'!F231","v":"FIXED ASSETS"}]
[null,"Data Input / INCOME TAX","Data Input",{"$f":"\"A\"&MATCH(F18,'Data Input'!$F$13:$F$719,0)+15","v":"A245"},"Data Input",{"$f":"'Data Input'!F242","v":"INCOME TAX"}]
[null,"Data Input / WORKING CAPITAL","Data Input",{"$f":"\"A\"&MATCH(F19,'Data Input'!$F$13:$F$719,0)+15","v":"A255"},"Data Input",{"$f":"'Data Input'!F252","v":"WORKING CAPITAL"}]
[null,"Data Input / WORKING CAPITAL","Data Input",{"$f":"\"A\"&MATCH(F20,'Data Input'!$F$13:$F$719,0)+14","v":"A254"},"Data Input",{"$f":"'Data Input'!F252","v":"WORKING CAPITAL"}]
{"$rows_left_out":54}